Build #2,467

Spring Data Redis

Build: #2467 failed Child of SDKV-KV-2015

Build result summary

Details

Completed
Duration
5 minutes
Labels
None
Agent
bamboo-10.af.pivotal.io
Revision
bf7095d645a58915f0d6d58730a52a6b323bb1f2 bf7095d645a58915f0d6d58730a52a6b323bb1f2
Total tests
11567
Fixed in
#2468 (Changes by Mark Paluch and Qiang Lee <18018968632@163.com>)

Responsible

No one has taken responsibility for this failure

Tests

New test failures 6
Status Test View job Duration
Collapse Failed RedisKeyValueAdapterTests updateShouldRemoveComplexObjectCorrectly[0] History
Default Job < 1 sec
org.springframework.data.redis.RedisSystemException: Unknown redis exception; nested exception is java.lang.ClassCastException: java.util.ArrayList cannot be cast to [B
	at org.springframework.data.redis.core.RedisKeyValueAdapterTests.lambda$setUp$0(RedisKeyValueAdapterTests.java:112)
	at org.springframework.data.redis.core.RedisKeyValueAdapterTests.setUp(RedisKeyValueAdapterTests.java:111)
Caused by: java.lang.ClassCastException: java.util.ArrayList cannot be cast to [B
	at org.springframework.data.redis.core.RedisKeyValueAdapterTests.lambda$setUp$0(RedisKeyValueAdapterTests.java:112)
	at org.springframework.data.redis.core.RedisKeyValueAdapterTests.setUp(RedisKeyValueAdapterTests.java:111)
Collapse Failed RedisKeyValueAdapterTests updateShouldAlterIndexDataOnNestedObjectPathCorrectly[0] History
Default Job < 1 sec
org.springframework.dao.InvalidDataAccessApiUsageException: ERR wrong number of arguments for 'psubscribe' command; nested exception is redis.clients.jedis.exceptions.JedisDataException: ERR wrong number of arguments for 'psubscribe' command
	at org.springframework.data.redis.core.RedisKeyValueAdapterTests.lambda$setUp$0(RedisKeyValueAdapterTests.java:112)
	at org.springframework.data.redis.core.RedisKeyValueAdapterTests.setUp(RedisKeyValueAdapterTests.java:111)
Caused by: redis.clients.jedis.exceptions.JedisDataException: ERR wrong number of arguments for 'psubscribe' command
	at org.springframework.data.redis.core.RedisKeyValueAdapterTests.lambda$setUp$0(RedisKeyValueAdapterTests.java:112)
	at org.springframework.data.redis.core.RedisKeyValueAdapterTests.setUp(RedisKeyValueAdapterTests.java:111)
Collapse Failed RedisKeyValueAdapterTests updateShouldAlterIndexDataForObjectsWithColonInIdCorrectly[0] History
Default Job < 1 sec
org.springframework.dao.InvalidDataAccessApiUsageException: ERR wrong number of arguments for 'psubscribe' command; nested exception is redis.clients.jedis.exceptions.JedisDataException: ERR wrong number of arguments for 'psubscribe' command
	at org.springframework.data.redis.core.RedisKeyValueAdapterTests.lambda$setUp$0(RedisKeyValueAdapterTests.java:112)
	at org.springframework.data.redis.core.RedisKeyValueAdapterTests.setUp(RedisKeyValueAdapterTests.java:111)
Caused by: redis.clients.jedis.exceptions.JedisDataException: ERR wrong number of arguments for 'psubscribe' command
	at org.springframework.data.redis.core.RedisKeyValueAdapterTests.lambda$setUp$0(RedisKeyValueAdapterTests.java:112)
	at org.springframework.data.redis.core.RedisKeyValueAdapterTests.setUp(RedisKeyValueAdapterTests.java:111)
Collapse Failed RedisKeyValueAdapterTests keyExpiredEventShouldRemoveHelperStructuresForObjectsWithColonInId[0] History
Default Job < 1 sec
org.springframework.dao.InvalidDataAccessApiUsageException: ERR only (P)SUBSCRIBE / (P)UNSUBSCRIBE / PING / QUIT allowed in this context; nested exception is redis.clients.jedis.exceptions.JedisDataException: ERR only (P)SUBSCRIBE / (P)UNSUBSCRIBE / PING / QUIT allowed in this context
	at org.springframework.data.redis.core.RedisKeyValueAdapterTests.lambda$setUp$0(RedisKeyValueAdapterTests.java:112)
	at org.springframework.data.redis.core.RedisKeyValueAdapterTests.setUp(RedisKeyValueAdapterTests.java:111)
Caused by: redis.clients.jedis.exceptions.JedisDataException: ERR only (P)SUBSCRIBE / (P)UNSUBSCRIBE / PING / QUIT allowed in this context
	at org.springframework.data.redis.core.RedisKeyValueAdapterTests.lambda$setUp$0(RedisKeyValueAdapterTests.java:112)
	at org.springframework.data.redis.core.RedisKeyValueAdapterTests.setUp(RedisKeyValueAdapterTests.java:111)
Collapse Failed RedisKeyValueAdapterTests updateShouldRemoveSimpleListValuesCorrectly[0] History
Default Job < 1 sec
org.springframework.dao.InvalidDataAccessApiUsageException: ERR wrong number of arguments for 'psubscribe' command; nested exception is redis.clients.jedis.exceptions.JedisDataException: ERR wrong number of arguments for 'psubscribe' command
	at org.springframework.data.redis.core.RedisKeyValueAdapterTests.lambda$setUp$0(RedisKeyValueAdapterTests.java:112)
	at org.springframework.data.redis.core.RedisKeyValueAdapterTests.setUp(RedisKeyValueAdapterTests.java:111)
Caused by: redis.clients.jedis.exceptions.JedisDataException: ERR wrong number of arguments for 'psubscribe' command
	at org.springframework.data.redis.core.RedisKeyValueAdapterTests.lambda$setUp$0(RedisKeyValueAdapterTests.java:112)
	at org.springframework.data.redis.core.RedisKeyValueAdapterTests.setUp(RedisKeyValueAdapterTests.java:111)
Collapse Failed RedisKeyValueAdapterTests deleteCleansIndexedDataCorrectly[0] History
Default Job < 1 sec
org.springframework.data.redis.RedisSystemException: Unknown redis exception; nested exception is java.lang.ClassCastException: java.util.ArrayList cannot be cast to java.lang.Long
	at org.springframework.data.redis.core.RedisKeyValueAdapterTests.deleteCleansIndexedDataCorrectly(RedisKeyValueAdapterTests.java:295)
Caused by: java.lang.ClassCastException: java.util.ArrayList cannot be cast to java.lang.Long
	at org.springframework.data.redis.core.RedisKeyValueAdapterTests.deleteCleansIndexedDataCorrectly(RedisKeyValueAdapterTests.java:295)