Build #132

Build: #132 failed Scheduled

Logs

The following logs have been generated by the jobs in this branch.
  • Expand all
  • Collapse all
Job Logs
Collapse Build Build Download or View
13-Jul-2019 02:32:34 [INFO] Spring Data REST - Core ............................ SKIPPED
13-Jul-2019 02:32:34 [INFO] Spring Data REST - WebMVC .......................... SKIPPED
13-Jul-2019 02:32:34 [INFO] Spring Data REST - Distribution .................... SKIPPED
13-Jul-2019 02:32:34 [INFO] Spring Data REST - HAL Browser ..................... SKIPPED
13-Jul-2019 02:32:34 [INFO] Spring Data REST Tests ............................. SKIPPED
13-Jul-2019 02:32:34 [INFO] Spring Data REST Tests - Core ...................... SKIPPED
13-Jul-2019 02:32:34 [INFO] Spring Data REST Tests - Gemfire ................... SKIPPED
13-Jul-2019 02:32:34 [INFO] Spring Data REST Tests - JPA ....................... SKIPPED
13-Jul-2019 02:32:34 [INFO] Spring Data REST Tests - MongoDB ................... SKIPPED
13-Jul-2019 02:32:34 [INFO] Spring Data REST Tests - Security .................. SKIPPED
13-Jul-2019 02:32:34 [INFO] Spring Data REST Tests - Shop ...................... SKIPPED
13-Jul-2019 02:32:34 [INFO] Spring Data REST Tests - Solr 3.2.0.DATAREST-1304-SNAPSHOT SKIPPED
13-Jul-2019 02:32:34 [INFO] ------------------------------------------------------------------------
13-Jul-2019 02:32:34 [INFO] BUILD FAILURE
13-Jul-2019 02:32:34 [INFO] ------------------------------------------------------------------------
13-Jul-2019 02:32:34 [INFO] Total time: 2.654 s
13-Jul-2019 02:32:34 [INFO] Finished at: 2019-07-13T02:32:34Z
13-Jul-2019 02:32:34 [INFO] ------------------------------------------------------------------------
13-Jul-2019 02:32:34 [ERROR] Failed to execute goal org.apache.maven.plugins:maven-checkstyle-plugin:3.1.0:check (default) on project spring-data-rest-parent: You have 105 Checkstyle violations. -> [Help 1]
13-Jul-2019 02:32:34 [ERROR]
13-Jul-2019 02:32:34 [ERROR] To see the full stack trace of the errors, re-run Maven with the -e switch.
13-Jul-2019 02:32:34 [ERROR] Re-run Maven using the -X switch to enable full debug logging.
13-Jul-2019 02:32:34 [ERROR]
13-Jul-2019 02:32:34 [ERROR] For more information about the errors and possible solutions, please read the following articles:
13-Jul-2019 02:32:34 [ERROR] [Help 1] http://cwiki.apache.org/confluence/display/MAVEN/MojoFailureException