Build #162

Build: #162 failed Scheduled

Logs

The following logs have been generated by the jobs in this branch.
  • Expand all
  • Collapse all
Job Logs
Collapse Build Build Download or View
12-Aug-2019 02:32:52 [INFO] Spring Data REST - Core ............................ SKIPPED
12-Aug-2019 02:32:52 [INFO] Spring Data REST - WebMVC .......................... SKIPPED
12-Aug-2019 02:32:52 [INFO] Spring Data REST - Distribution .................... SKIPPED
12-Aug-2019 02:32:52 [INFO] Spring Data REST - HAL Browser ..................... SKIPPED
12-Aug-2019 02:32:52 [INFO] Spring Data REST Tests ............................. SKIPPED
12-Aug-2019 02:32:52 [INFO] Spring Data REST Tests - Core ...................... SKIPPED
12-Aug-2019 02:32:52 [INFO] Spring Data REST Tests - Gemfire ................... SKIPPED
12-Aug-2019 02:32:52 [INFO] Spring Data REST Tests - JPA ....................... SKIPPED
12-Aug-2019 02:32:52 [INFO] Spring Data REST Tests - MongoDB ................... SKIPPED
12-Aug-2019 02:32:52 [INFO] Spring Data REST Tests - Security .................. SKIPPED
12-Aug-2019 02:32:52 [INFO] Spring Data REST Tests - Shop ...................... SKIPPED
12-Aug-2019 02:32:52 [INFO] Spring Data REST Tests - Solr 3.2.0.DATAREST-1304-SNAPSHOT SKIPPED
12-Aug-2019 02:32:52 [INFO] ------------------------------------------------------------------------
12-Aug-2019 02:32:52 [INFO] BUILD FAILURE
12-Aug-2019 02:32:52 [INFO] ------------------------------------------------------------------------
12-Aug-2019 02:32:52 [INFO] Total time: 2.575 s
12-Aug-2019 02:32:52 [INFO] Finished at: 2019-08-12T02:32:52Z
12-Aug-2019 02:32:52 [INFO] ------------------------------------------------------------------------
12-Aug-2019 02:32:52 [ERROR] Failed to execute goal org.apache.maven.plugins:maven-checkstyle-plugin:3.1.0:check (default) on project spring-data-rest-parent: You have 105 Checkstyle violations. -> [Help 1]
12-Aug-2019 02:32:52 [ERROR]
12-Aug-2019 02:32:52 [ERROR] To see the full stack trace of the errors, re-run Maven with the -e switch.
12-Aug-2019 02:32:52 [ERROR] Re-run Maven using the -X switch to enable full debug logging.
12-Aug-2019 02:32:52 [ERROR]
12-Aug-2019 02:32:52 [ERROR] For more information about the errors and possible solutions, please read the following articles:
12-Aug-2019 02:32:52 [ERROR] [Help 1] http://cwiki.apache.org/confluence/display/MAVEN/MojoFailureException