Spring Web Flow master

Build: #52 failed

Job: Default Job failed

Stages & jobs

  1. Default Stage

Get flow registry: Test case result

The below summarizes the result of the test "Get flow registry" in build 52 of Spring Web Flow - master - Default Job. View test case history
Description
Get flow registry
Test class
org.springframework.webflow.config.FlowRegistryFactoryBeanTests
Method
testGetFlowRegistry
Duration
< 1 sec
Status
Failed (New Failure)

Error Log

java.lang.IllegalStateException: java.lang.IllegalStateException: Unable to validate using XSD: Your JAXP provider [com.sun.org.apache.xerces.internal.jaxp.DocumentBuilderFactoryImpl@c0005ba] does not support XML Schema. Are you running on Java 1.4 or below with Apache Crimson? If so you must upgrade to Apache Xerces (or Java 5 or >) for full XSD support.
java.lang.IllegalStateException: Unable to validate using XSD: Your JAXP provider [com.sun.org.apache.xerces.internal.jaxp.DocumentBuilderFactoryImpl@c0005ba] does not support XML Schema. Are you running on Java 1.4 or below with Apache Crimson? If so you must upgrade to Apache Xerces (or Java 5 or >) for full XSD support.
	at org.springframework.webflow.engine.model.builder.xml.DefaultDocumentLoader.loadDocument(DefaultDocumentLoader.java:105)
	at org.springframework.webflow.engine.model.builder.xml.XmlFlowModelBuilder.init(XmlFlowModelBuilder.java:118)
	at org.springframework.webflow.engine.model.builder.DefaultFlowModelHolder.assembleFlowModel(DefaultFlowModelHolder.java:87)
	at org.springframework.webflow.engine.model.builder.DefaultFlowModelHolder.getFlowModel(DefaultFlowModelHolder.java:61)
	at org.springframework.webflow.engine.builder.model.FlowModelFlowBuilder.doInit(FlowModelFlowBuilder.java:151)
	at org.springframework.webflow.engine.builder.support.AbstractFlowBuilder.init(AbstractFlowBuilder.java:46)
	at org.springframework.webflow.engine.builder.FlowAssembler.assembleFlow(FlowAssembler.java:90)
	at org.springframework.webflow.engine.builder.DefaultFlowHolder.assembleFlow(DefaultFlowHolder.java:109)
	at org.springframework.webflow.engine.builder.DefaultFlowHolder.getFlowDefinition(DefaultFlowHolder.java:84)
	at org.springframework.webflow.definition.registry.FlowDefinitionRegistryImpl.getFlowDefinition(FlowDefinitionRegistryImpl.java:60)
	at org.springframework.webflow.config.FlowRegistryFactoryBeanTests.testGetFlowRegistry(FlowRegistryFactoryBeanTests.java:33)
	at sun.reflect.NativeMethodAccessorImpl.invoke0(Native Method)
	at sun.reflect.NativeMethodAccessorImpl.invoke(NativeMethodAccessorImpl.java:62)
	at sun.reflect.DelegatingMethodAccessorImpl.invoke(DelegatingMethodAccessorImpl.java:43)
	at java.lang.reflect.Method.invoke(Method.java:498)
	at junit.framework.TestCase.runTest(TestCase.java:176)
	at junit.framework.TestCase.runBare(TestCase.java:141)
	at junit.framework.TestResult$1.protect(TestResult.java:122)
	at junit.framework.TestResult.runProtected(TestResult.java:142)
	at junit.framework.TestResult.run(TestResult.java:125)
	at junit.framework.TestCase.run(TestCase.java:129)
	at junit.framework.TestSuite.runTest(TestSuite.java:252)
	at junit.framework.TestSuite.run(TestSuite.java:247)
	at org.junit.internal.runners.JUnit38ClassRunner.run(JUnit38ClassRunner.java:86)
	at org.gradle.api.internal.tasks.testing.junit.JUnitTestClassExecuter.runTestClass(JUnitTestClassExecuter.java:114)
	at org.gradle.api.internal.tasks.testing.junit.JUnitTestClassExecuter.execute(JUnitTestClassExecuter.java:57)
	at org.gradle.api.internal.tasks.testing.junit.JUnitTestClassProcessor.processTestClass(JUnitTestClassProcessor.java:66)
	at org.gradle.api.internal.tasks.testing.SuiteTestClassProcessor.processTestClass(SuiteTestClassProcessor.java:51)
	at sun.reflect.NativeMethodAccessorImpl.invoke0(Native Method)
	at sun.reflect.NativeMethodAccessorImpl.invoke(NativeMethodAccessorImpl.java:62)
	at sun.reflect.DelegatingMethodAccessorImpl.invoke(DelegatingMethodAccessorImpl.java:43)
	at java.lang.reflect.Method.invoke(Method.java:498)
	at org.gradle.internal.dispatch.ReflectionDispatch.dispatch(ReflectionDispatch.java:35)
	at org.gradle.internal.dispatch.ReflectionDispatch.dispatch(ReflectionDispatch.java:24)
	at org.gradle.internal.dispatch.ContextClassLoaderDispatch.dispatch(ContextClassLoaderDispatch.java:32)
	at org.gradle.internal.dispatch.ProxyDispatchAdapter$DispatchingInvocationHandler.invoke(ProxyDispatchAdapter.java:93)
	at com.sun.proxy.$Proxy1.processTestClass(Unknown Source)
	at org.gradle.api.internal.tasks.testing.worker.TestWorker.processTestClass(TestWorker.java:108)
	at sun.reflect.NativeMethodAccessorImpl.invoke0(Native Method)
	at sun.reflect.NativeMethodAccessorImpl.invoke(NativeMethodAccessorImpl.java:62)
	at sun.reflect.DelegatingMethodAccessorImpl.invoke(DelegatingMethodAccessorImpl.java:43)
	at java.lang.reflect.Method.invoke(Method.java:498)
	at org.gradle.internal.dispatch.ReflectionDispatch.dispatch(ReflectionDispatch.java:35)
	at org.gradle.internal.dispatch.ReflectionDispatch.dispatch(ReflectionDispatch.java:24)
	at org.gradle.internal.remote.internal.hub.MessageHubBackedObjectConnection$DispatchWrapper.dispatch(MessageHubBackedObjectConnection.java:146)
	at org.gradle.internal.remote.internal.hub.MessageHubBackedObjectConnection$DispatchWrapper.dispatch(MessageHubBackedObjectConnection.java:128)
	at org.gradle.internal.remote.internal.hub.MessageHub$Handler.run(MessageHub.java:404)
	at org.gradle.internal.concurrent.ExecutorPolicy$CatchAndRecordFailures.onExecute(ExecutorPolicy.java:63)
	at org.gradle.internal.concurrent.ManagedExecutorImpl$1.run(ManagedExecutorImpl.java:46)
	at java.util.concurrent.ThreadPoolExecutor.runWorker(ThreadPoolExecutor.java:1149)
	at java.util.concurrent.ThreadPoolExecutor$Worker.run(ThreadPoolExecutor.java:624)
	at org.gradle.internal.concurrent.ThreadFactoryImpl$ManagedThreadRunnable.run(ThreadFactoryImpl.java:55)
	at java.lang.Thread.run(Thread.java:748)