Spring Web Flow master

Build: #63 failed

Job: Default Job failed

Stages & jobs

  1. Default Stage

Job result summary

Completed
Duration
7 seconds
Agent
bamboo-22.af.pivotal.io
Revision
f5513f01892aa563317684ef9532fac49777a976 f5513f01892aa563317684ef9532fac49777a976
Fixed in
#64 (Code changes detected)
No failed test found. A possible compilation error occurred.

Error summary

The build generated some errors. See the full build log for more details.

Could not find test result reports in the /opt/bamboo-home/xml-data/build-dir/SWF-B25X-JOB1 directory.
        at org.gradle.tooling.internal.provider.GradleThreadBuildActionExecuter.execute(GradleThreadBuildActionExecuter.java:26)
        at org.gradle.tooling.internal.provider.ParallelismConfigurationBuildActionExecuter.execute(ParallelismConfigurationBuildActionExecuter.java:43)
        at org.gradle.tooling.internal.provider.ParallelismConfigurationBuildActionExecuter.execute(ParallelismConfigurationBuildActionExecuter.java:29)
        at org.gradle.tooling.internal.provider.StartParamsValidatingActionExecuter.execute(StartParamsValidatingActionExecuter.java:60)
        at org.gradle.tooling.internal.provider.StartParamsValidatingActionExecuter.execute(StartParamsValidatingActionExecuter.java:32)
        at org.gradle.tooling.internal.provider.SessionFailureReportingActionExecuter.execute(SessionFailureReportingActionExecuter.java:55)
        at org.gradle.tooling.internal.provider.SessionFailureReportingActionExecuter.execute(SessionFailureReportingActionExecuter.java:41)
        at org.gradle.tooling.internal.provider.SetupLoggingActionExecuter.execute(SetupLoggingActionExecuter.java:48)
        at org.gradle.tooling.internal.provider.SetupLoggingActionExecuter.execute(SetupLoggingActionExecuter.java:32)
        at org.gradle.launcher.cli.RunBuildAction.run(RunBuildAction.java:56)
        at org.gradle.internal.Actions$RunnableActionAdapter.execute(Actions.java:212)
        at org.gradle.launcher.cli.DefaultCommandLineActionFactory$ParseAndBuildAction.execute(DefaultCommandLineActionFactory.java:404)
        at org.gradle.launcher.cli.DefaultCommandLineActionFactory$ParseAndBuildAction.execute(DefaultCommandLineActionFactory.java:376)
        at org.gradle.launcher.cli.ExceptionReportingAction.execute(ExceptionReportingAction.java:38)
        at org.gradle.launcher.cli.ExceptionReportingAction.execute(ExceptionReportingAction.java:23)
        at org.gradle.launcher.cli.DefaultCommandLineActionFactory$WithLogging.execute(DefaultCommandLineActionFactory.java:369)
        at org.gradle.launcher.Main.doAction(Main.java:35)
        at org.gradle.launcher.bootstrap.EntryPoint.run(EntryPoint.java:45)
        at org.gradle.launcher.bootstrap.ProcessBootstrap.runNoExit(ProcessBootstrap.java:60)
        at org.gradle.launcher.bootstrap.ProcessBootstrap.run(ProcessBootstrap.java:37)
        at org.gradle.launcher.GradleMain.main(GradleMain.java:31)
        at org.gradle.wrapper.BootstrapMainStarter.start(BootstrapMainStarter.java:31)
        at org.gradle.wrapper.WrapperExecutor.execute(WrapperExecutor.java:108)
        at org.gradle.wrapper.GradleWrapperMain.main(GradleWrapperMain.java:63)
Caused by: org.gradle.api.plugins.InvalidPluginException: Could not find implementation class 'org.springframework.build.optional.OptionalDependenciesPlugin' for plugin 'org.springframework.build.optional-dependencies' specified in jar:file:/opt/users/bamboo/.gradle/caches/jars-3/12b19132409487cfe64889dd857fb468/buildSrc.jar!/META-INF/gradle-plugins/org.springframework.build.optional-dependencies.properties.
        at org.gradle.api.internal.plugins.DefaultPluginRegistry$1.load(DefaultPluginRegistry.java:73)
        at org.gradle.api.internal.plugins.DefaultPluginRegistry$1.load(DefaultPluginRegistry.java:51)
        at com.google.common.cache.LocalCache$LoadingValueReference.loadFuture(LocalCache.java:3445)
        at com.google.common.cache.LocalCache$Segment.loadSync(LocalCache.java:2194)
        at com.google.common.cache.LocalCache$Segment.lockedGetOrLoad(LocalCache.java:2153)
        at com.google.common.cache.LocalCache$Segment.get(LocalCache.java:2043)
        at com.google.common.cache.LocalCache.get(LocalCache.java:3851)
        at com.google.common.cache.LocalCache.getOrLoad(LocalCache.java:3875)
        at com.google.common.cache.LocalCache$LocalLoadingCache.get(LocalCache.java:4800)
        at org.gradle.api.internal.plugins.DefaultPluginRegistry.uncheckedGet(DefaultPluginRegistry.java:151)
        at org.gradle.api.internal.plugins.DefaultPluginRegistry.lookup(DefaultPluginRegistry.java:146)
        at org.gradle.api.internal.plugins.DefaultPluginRegistry.lookup(DefaultPluginRegistry.java:129)
        at org.gradle.api.internal.plugins.DefaultPluginRegistry.lookup(DefaultPluginRegistry.java:123)
        at org.gradle.api.internal.plugins.DefaultPluginManager.apply(DefaultPluginManager.java:132)
        at org.gradle.api.internal.plugins.DefaultObjectConfigurationAction.applyType(DefaultObjectConfigurationAction.java:129)
        at org.gradle.api.internal.plugins.DefaultObjectConfigurationAction.access$200(DefaultObjectConfigurationAction.java:38)
        at org.gradle.api.internal.plugins.DefaultObjectConfigurationAction$3.run(DefaultObjectConfigurationAction.java:93)
        at org.gradle.api.internal.plugins.DefaultObjectConfigurationAction.execute(DefaultObjectConfigurationAction.java:152)
        at org.gradle.api.internal.project.AbstractPluginAware.apply(AbstractPluginAware.java:49)
        at org.gradle.internal.metaobject.BeanDynamicObject$MetaClassAdapter.invokeMethod(BeanDynamicObject.java:479)
        at org.gradle.internal.metaobject.BeanDynamicObject.tryInvokeMethod(BeanDynamicObject.java:191)
        at org.gradle.internal.metaobject.CompositeDynamicObject.tryInvokeMethod(CompositeDynamicObject.java:98)
        at org.gradle.internal.extensibility.MixInClosurePropertiesAsMethodsDynamicObject.tryInvokeMethod(MixInClosurePropertiesAsMethodsDynamicObject.java:33)
        at org.gradle.internal.metaobject.ConfigureDelegate.invokeMethod(ConfigureDelegate.java:56)
        at build_2hm0on41jrwe42ah7rrhsyctg$_run_closure2.doCall(/opt/bamboo-home/xml-data/build-dir/SWF-B25X-JOB1/build.gradle:28)
        at org.gradle.util.ClosureBackedAction.execute(ClosureBackedAction.java:71)
        at org.gradle.util.ConfigureUtil.configureTarget(ConfigureUtil.java:154)
        at org.gradle.util.ConfigureUtil.configure(ConfigureUtil.java:105)
        at org.gradle.util.ConfigureUtil$WrappedConfigureAction.execute(ConfigureUtil.java:166)
        at org.gradle.api.internal.DefaultMutationGuard$2.execute(DefaultMutationGuard.java:42)
        at org.gradle.internal.Actions.with(Actions.java:251)
        at org.gradle.api.internal.project.BuildOperationCrossProjectConfigurator$2$1.run(BuildOperationCrossProjectConfigurator.java:79)
        at org.gradle.internal.operations.DefaultBuildOperationExecutor$RunnableBuildOperationWorker.execute(DefaultBuildOperationExecutor.java:402)
        at org.gradle.internal.operations.DefaultBuildOperationExecutor$RunnableBuildOperationWorker.execute(DefaultBuildOperationExecutor.java:394)
        at org.gradle.internal.operations.DefaultBuildOperationExecutor$1.execute(DefaultBuildOperationExecutor.java:165)
        at org.gradle.internal.operations.DefaultBuildOperationExecutor.execute(DefaultBuildOperationExecutor.java:250)
        at org.gradle.internal.operations.DefaultBuildOperationExecutor.execute(DefaultBuildOperationExecutor.java:158)
        at org.gradle.internal.operations.DefaultBuildOperationExecutor.run(DefaultBuildOperationExecutor.java:92)
        at org.gradle.internal.operations.DelegatingBuildOperationExecutor.run(DelegatingBuildOperationExecutor.java:31)
        at org.gradle.api.internal.project.BuildOperationCrossProjectConfigurator$2.run(BuildOperationCrossProjectConfigurator.java:76)
        at org.gradle.internal.Factories$1.create(Factories.java:26)
        at org.gradle.api.internal.project.DefaultProjectStateRegistry$ProjectStateImpl.withMutableState(DefaultProjectStateRegistry.java:201)
        at org.gradle.api.internal.project.DefaultProjectStateRegistry$ProjectStateImpl.withMutableState(DefaultProjectStateRegistry.java:187)
        at org.gradle.api.internal.project.BuildOperationCrossProjectConfigurator.runProjectConfigureAction(BuildOperationCrossProjectConfigurator.java:73)
        at org.gradle.api.internal.project.BuildOperationCrossProjectConfigurator.access$400(BuildOperationCrossProjectConfigurator.java:32)
        at org.gradle.api.internal.project.BuildOperationCrossProjectConfigurator$1.doRunProjectConfigure(BuildOperationCrossProjectConfigurator.java:67)
        at org.gradle.api.internal.project.BuildOperationCrossProjectConfigurator$BlockConfigureBuildOperation.run(BuildOperationCrossProjectConfigurator.java:121)
        at org.gradle.internal.operations.DefaultBuildOperationExecutor$RunnableBuildOperationWorker.execute(DefaultBuildOperationExecutor.java:402)
        at org.gradle.internal.operations.DefaultBuildOperationExecutor$RunnableBuildOperationWorker.execute(DefaultBuildOperationExecutor.java:394)
        at org.gradle.internal.operations.DefaultBuildOperationExecutor$1.execute(DefaultBuildOperationExecutor.java:165)
        at org.gradle.internal.operations.DefaultBuildOperationExecutor.execute(DefaultBuildOperationExecutor.java:250)
        at org.gradle.internal.operations.DefaultBuildOperationExecutor.execute(DefaultBuildOperationExecutor.java:158)
        at org.gradle.internal.operations.DefaultBuildOperationExecutor.run(DefaultBuildOperationExecutor.java:92)
        at org.gradle.internal.operations.DelegatingBuildOperationExecutor.run(DelegatingBuildOperationExecutor.java:31)
        at org.gradle.api.internal.project.BuildOperationCrossProjectConfigurator.runBlockConfigureAction(BuildOperationCrossProjectConfigurator.java:64)
        at org.gradle.api.internal.project.BuildOperationCrossProjectConfigurator.allprojects(BuildOperationCrossProjectConfigurator.java:54)
        at org.gradle.api.internal.project.DefaultProject.allprojects(DefaultProject.java:1154)
        at org.gradle.internal.metaobject.BeanDynamicObject$MetaClassAdapter.invokeMethod(BeanDynamicObject.java:479)
        at org.gradle.internal.metaobject.BeanDynamicObject.tryInvokeMethod(BeanDynamicObject.java:191)
        at org.gradle.internal.metaobject.CompositeDynamicObject.tryInvokeMethod(CompositeDynamicObject.java:98)
        at org.gradle.internal.extensibility.MixInClosurePropertiesAsMethodsDynamicObject.tryInvokeMethod(MixInClosurePropertiesAsMethodsDynamicObject.java:33)
        at org.gradle.groovy.scripts.BasicScript$ScriptDynamicObject.tryInvokeMethod(BasicScript.java:134)
        at org.gradle.internal.metaobject.AbstractDynamicObject.invokeMethod(AbstractDynamicObject.java:162)
        at org.gradle.groovy.scripts.BasicScript.invokeMethod(BasicScript.java:83)
        at build_2hm0on41jrwe42ah7rrhsyctg.run(/opt/bamboo-home/xml-data/build-dir/SWF-B25X-JOB1/build.gradle:23)
        at org.gradle.groovy.scripts.internal.DefaultScriptRunnerFactory$ScriptRunnerImpl.run(DefaultScriptRunnerFactory.java:91)
        ... 117 more
Caused by: java.lang.ClassNotFoundException: org.springframework.build.optional.OptionalDependenciesPlugin
        at org.gradle.api.internal.plugins.DefaultPluginRegistry$1.load(DefaultPluginRegistry.java:71)
        ... 182 more


* Get more help at https://help.gradle.org

BUILD FAILED in 7s