Spring Web Flow master

Build: #63 failed

Job: Default Job failed

Stages & jobs

  1. Default Stage

Build log

The build generated 283 lines of output. Download or view full build log

01-May-2020 06:38:23 Build Spring Web Flow - master - Default Job #63 (SWF-B25X-JOB1-63) started building on agent bamboo-22.af.pivotal.io
01-May-2020 06:38:23 Remote agent on host bamboo-22.af.pivotal.io
01-May-2020 06:38:23 Build working directory is /opt/bamboo-home/xml-data/build-dir/SWF-B25X-JOB1
01-May-2020 06:38:23 Executing build Spring Web Flow - master - Default Job #63 (SWF-B25X-JOB1-63)
01-May-2020 06:38:23 Starting task 'Checkout Default Repository' of type 'com.atlassian.bamboo.plugins.vcs:task.vcs.checkout'
01-May-2020 06:38:23 Build always requires a clean checkout
01-May-2020 06:38:23 Cleaning build directory '/opt/bamboo-home/xml-data/build-dir/SWF-B25X-JOB1'
01-May-2020 06:38:23 Checking out into /opt/bamboo-home/xml-data/build-dir/SWF-B25X-JOB1
01-May-2020 06:38:23 Updating source code to revision: f5513f01892aa563317684ef9532fac49777a976
01-May-2020 06:38:23 Creating local git repository in '/opt/bamboo-home/xml-data/build-dir/SWF-B25X-JOB1/.git'.
01-May-2020 06:38:23 Initialized empty Git repository in /opt/bamboo-home/xml-data/build-dir/SWF-B25X-JOB1/.git/
01-May-2020 06:38:24 Fetching 'refs/heads/master' from 'https://github.com/spring-projects/spring-webflow.git'.
01-May-2020 06:38:26 From https://github.com/spring-projects/spring-webflow
01-May-2020 06:38:26 * [new branch]      master     -> master
01-May-2020 06:38:26 * [new tag]           v2.3.1.RELEASE -> v2.3.1.RELEASE
01-May-2020 06:38:26 * [new tag]           v2.4.0.M1      -> v2.4.0.M1
01-May-2020 06:38:26 * [new tag]           v2.4.2.RELEASE -> v2.4.2.RELEASE
01-May-2020 06:38:26 * [new tag]           v2.4.4.RELEASE -> v2.4.4.RELEASE
01-May-2020 06:38:26 Checking out revision f5513f01892aa563317684ef9532fac49777a976.
01-May-2020 06:38:26 Already on 'master'
01-May-2020 06:38:26 Updated source code to revision: f5513f01892aa563317684ef9532fac49777a976
01-May-2020 06:38:26 Finished task 'Checkout Default Repository' with result: Success
01-May-2020 06:38:26 Running pre-build action: Artifactory Release Staging
01-May-2020 06:38:26 Running pre-build action: VCS Version Collector
01-May-2020 06:38:26
Substituting variable: ${bamboo.repository.branch.name} with master
01-May-2020 06:38:26 Starting task 'Artifactory Gradle' of type 'org.jfrog.bamboo.bamboo-artifactory-plugin:artifactoryGradleTask'
01-May-2020 06:38:26 Bamboo Artifactory Plugin version: 3.0.1
01-May-2020 06:38:26
Beginning to execute external process for build 'Spring Web Flow - master - Default Job #63 (SWF-B25X-JOB1-63)'
... running command line:
./gradlew --refresh-dependencies --no-daemon -PtestGroups=ci -P BRANCH_NAME=master --stacktrace clean build -I /tmp/artifactory.init.script4175298378867019279gradle -DbuildInfoConfig.propertiesFile=/tmp/buildinfo2938720340432586882properties artifactoryPublish -Dartifactory.resolve.password=******** -Dartifactory.publish.password=********
... in: /opt/bamboo-home/xml-data/build-dir/SWF-B25X-JOB1
... using extra environment variables:
bamboo_planRepository_1_branch=master
bamboo_********_username_password=********
bamboo_signing_store_password=********
bamboo_capability_system_builder_ant_Ant_1_9=/opt/ant-1.9
bamboo_capability_system_builder_ant_Ant_1_8=/opt/ant-1.8
bamboo_planRepository_1_branchDisplayName=master
bamboo_artifactory_override_resolve_repo=libs-milestone
bamboo_capability_system_builder_node_Node_js_10_16=/opt/node-10.16/bin/node
bamboo_repository_revision_number=f5513f01892aa563317684ef9532fac49777a976
bamboo_RIAK_BIN=/usr/sbin/riak
WRAPPER_BITS=32
bamboo_buildKey=SWF-B25X-JOB1
bamboo_ge_cache_username=ci
bamboo_bintray_password=********
bamboo_gradle_enterprise_cache_user=ci
bamboo_sonar_token_password=********
PWD=/opt/bamboo-home/bin
bamboo_repository_225214478_git_repositoryUrl=https://github.com/spring-projects/spring-webflow.git
bamboo_shortJobName=Default Job
bamboo_artifactory_override_resolver_password=********
bamboo_sonatype_token=RSJChaox
bamboo_capability_system_builder_gradle___gradlew=./gradlew
bamboo_buildResultsUrl=https://build.spring.io/browse/SWF-B25X-JOB1-63
bamboo_capability_system_builder_mvn3_Maven_3_3=/opt/maven-3.3
bamboo_capability_system_builder_mvn3_Maven_3_2=/opt/maven-3.2
bamboo_capability_system_builder_mvn3_Maven_3_1=/opt/maven-3.1
bamboo_planRepository_repositoryUrl=https://github.com/spring-projects/spring-webflow.git
bamboo_capability_system_builder_mvn3_Maven_3_6=/opt/maven-3.6
bamboo_agentId=286195714
bamboo_capability_system_builder_mvn3_Maven_3_5=/opt/maven-3.5
bamboo_repository_225214478_revision_number=f5513f01892aa563317684ef9532fac49777a976
bamboo_repository_225214478_name=github-spring-webflow-master
bamboo_capability_system_builder_mvn3_Maven_3_0=/opt/maven-3.0
bamboo_repository_225214478_git_branch=master
bamboo_planRepository_revision=f5513f01892aa563317684ef9532fac49777a976
bamboo_planRepository_previousRevision=08135062665fcfe71af8776003c3d7824b591bbd
bamboo_capability_remote_build=true
bamboo_repository_branch_name=master
bamboo_sonatype_token_password=********
bamboo_sonatype_user=springsource
SHLVL=1
bamboo_gradle_enterprise_cache_password=********
bamboo_org_jfrog_bamboo_buildInfo_serverUrl=https://repo.spring.io
bamboo_scdf_acceptance_tests_password=********
bamboo_APPLE_AC_PASSWORD=********
WRAPPER_OS=linux
JAVA_HOME=/opt/jdk-8/
TERM=linux
XDG_SESSION_ID=c1
bamboo_gradle_enterprise_secret_access_key=********
bamboo_planRepository_branch=master
bamboo_org_jfrog_bamboo_release_activated=false
bamboo_capability_system_jdk_JDK_15=/opt/jdk-15
bamboo_capability_system_jdk_JDK_13=/opt/jdk-13
bamboo_capability_system_jdk_JDK_14=/opt/jdk-14
bamboo_planRepository_1_type=gitv2
bamboo_planRepository_branchName=master
bamboo_capability_system_jdk_JDK_12=/opt/jdk-12
WRAPPER_FILE_SEPARATOR=/
_=/opt/bamboo-home/bin/bamboo-agent.sh
bamboo_capability_system_builder_gradlew_gradlew=./
bamboo_capability_system_builder_ant_Ant_1_10=/opt/ant-1.10
bamboo_repository_225214478_previous_revision_number=08135062665fcfe71af8776003c3d7824b591bbd
WRAPPER_PATH_SEPARATOR=:
bamboo_sonar_password=********
bamboo_hg_cache_directory=/opt/bamboo-home/xml-data/build-dir/_hg-repositories-cache
bamboo_planRepository_1_username=spring-buildmaster
bamboo_planRepository_type=gitv2
bamboo_git_cache_directory=/opt/bamboo-home/xml-data/build-dir/_git-repositories-cache
bamboo_artifactory_username=buildmaster
bamboo_tmp_directory=/opt/bamboo-home/temp
bamboo_planKey=SWF-B25X
bamboo_planRepository_username=spring-buildmaster
bamboo_JDK8_HOME=/opt/jdk-8
bamboo_planRepository_1_branchName=master
bamboo_sonar_version=6.7.7
bamboo_sonar_jdbc_password=********
bamboo_bintray_api_key_password=********
GRADLE_OPTS=-XX:MaxMetaspaceSize=1024m -Xmx1024m
XDG_DATA_DIRS=/usr/local/share:/usr/share:/var/lib/snapd/desktop
bamboo_capability_system_jdk_JDK_1_11=/opt/jdk-11
bamboo_resultsUrl=https://build.spring.io/browse/SWF-B25X-JOB1-63
bamboo_APPLE_AC_USERNAME_PASSWORD=********
bamboo_capability_system_jdk_JDK_1_10=/opt/jdk-10
bamboo_build_working_directory=/opt/bamboo-home/xml-data/build-dir/SWF-B25X-JOB1
bamboo_planRepository_1_name=github-spring-webflow-master
bamboo_capability_system_os=ubuntu1804
bamboo_nexusPush_stagingProfile=buildmaster
bamboo_shortPlanName=master
MAIL=/var/mail/bamboo
bamboo_planRepository_name=github-spring-webflow-master
LOGNAME=bamboo
bamboo_buildNumber=63
SHELL=/bin/bash
bamboo_planName=Spring Web Flow - master
bamboo_JDK7_HOME=/opt/jdk-7
bamboo_shortPlanKey=B25X
OLDPWD=/opt/users/bamboo
bamboo_shortJobKey=JOB1
bamboo_artifactory_password=********
bamboo_buildTimeStamp=2020-05-01T06:38:23.263Z
bamboo_repository_previous_revision_number=08135062665fcfe71af8776003c3d7824b591bbd
bamboo_sonar_username=buildmaster
bamboo_********_password=********
bamboo_repository_git_branch=master
bamboo_buildResultKey=SWF-B25X-JOB1-63
bamboo_nexusPush_close=true
bamboo_artifactory_override_resolver_username=buildmaster
bamboo_buildPlanName=Spring Web Flow - master - Default Job
bamboo_planRepository_1_revision=f5513f01892aa563317684ef9532fac49777a976
bamboo_repository_name=github-spring-webflow-master
bamboo_signing_key_password=********
bamboo_capability_system_builder_groovy_Groovy_2_5=/opt/groovy-2.5
LANG=en_US.UTF-8
bamboo_buildFailed=false
bamboo_capability_system_docker_executable=/usr/bin/docker
DISPLAY=localhost:1.0
bamboo_capability_system_jdk_OpenJDK_7=/opt/jdk-7
bamboo_capability_system_builder_groovy_Groovy_2_4=/opt/groovy-2.4
bamboo_artifactory_override_deployer_username=buildmaster
bamboo_artifactory_password_mask_b=********
bamboo_capability_system_builder_command_Bash=/bin/bash
bamboo_artifactory_password_mask_a=********
bamboo_agentWorkingDirectory=/opt/bamboo-home/xml-data/build-dir
bamboo_capability_system_git_executable=/usr/bin/git
bamboo_repository_git_username=spring-buildmaster
bamboo_planRepository_1_previousRevision=08135062665fcfe71af8776003c3d7824b591bbd
bamboo_repository_225214478_branch_name=master
bamboo_capability_os_family=unix
bamboo_planRepository_branchDisplayName=master
bamboo_capability_system_builder_maven_Artifactory_Maven_3_6=/opt/maven-3.6
bamboo_capability_system_builder_maven_Artifactory_Maven_3_5=/opt/maven-3.5
bamboo_repository_225214478_git_username=spring-buildmaster
GIT_SSL_NO_VERIFY=true
bamboo_capability_system_builder_maven_Artifactory_Maven_3_3=/opt/maven-3.3
bamboo_capability_system_builder_maven_Artifactory_Maven_3_2=/opt/maven-3.2
bamboo_s3_properties=/home/bamboo/tools/s3.properties
bamboo_capability_system_builder_maven_Artifactory_Maven_3_1=/opt/maven-3.1
bamboo_artifactory_override_deploy_repo=libs-snapshot-local
bamboo_capability_system_builder_maven_Artifactory_Maven_3_0=/opt/maven-3.0
bamboo_plan_storageTag=plan-224919572
bamboo_bintray_username_password=********
USER=bamboo
bamboo_repository_git_repositoryUrl=https://github.com/spring-projects/spring-webflow.git
bamboo_working_directory=/opt/bamboo-home/xml-data/build-dir/SWF-B25X-JOB1
bamboo_org_jfrog_bamboo_buildInfo_activated=true
bamboo_planRepository_1_repositoryUrl=https://github.com/spring-projects/spring-webflow.git
bamboo_capability_system_jdk_JDK_1_8=/opt/jdk-8
bamboo_artifactory_override_deployer_password=********
bamboo_capability_system_jdk_JDK_1_9=/opt/jdk-9
WRAPPER_ARCH=x86
bamboo_capability_system_jdk_JDK_1_6=/opt/jdk-6
bamboo_sonatype_password=********
bamboo_capability_system_jdk_JDK_1_7=/opt/jdk-7
bamboo_sonar_ip=10.194.6.9
XDG_RUNTIME_DIR=/run/user/1002
HOME=/home/bamboo
bamboo_ge_cache_password=********
PATH=/bin:/home/bamboo/bin:/usr/local/sbin:/usr/local/bin:/usr/sbin:/usr/bin:/sbin:/bin:/usr/games:/usr/local/games:/snap/bin:/home/bamboo/bin:/usr/local/bin:/bin:/home/bamboo/bin:/usr/local/sbin:/usr/local/bin:/usr/sbin:/usr/bin:/sbin:/bin:/usr/games:/usr/local/games:/snap/bin:/home/bamboo/bin:/usr/local/bin
01-May-2020 06:38:29 > Task :buildSrc:compileJava NO-SOURCE
01-May-2020 06:38:29 > Task :buildSrc:compileGroovy NO-SOURCE
01-May-2020 06:38:29 > Task :buildSrc:pluginDescriptors
01-May-2020 06:38:29 > Task :buildSrc:processResources
01-May-2020 06:38:29 > Task :buildSrc:classes
01-May-2020 06:38:29
01-May-2020 06:38:29 > Task :buildSrc:jar
01-May-2020 06:38:29 :jar: A valid plugin descriptor was found for org.springframework.build.optional-dependencies.properties but the implementation class org.springframework.build.optional.OptionalDependenciesPlugin was not found in the jar.
01-May-2020 06:38:29
01-May-2020 06:38:29 > Task :buildSrc:assemble
01-May-2020 06:38:29 > Task :buildSrc:pluginUnderTestMetadata
01-May-2020 06:38:29 > Task :buildSrc:compileTestJava NO-SOURCE
01-May-2020 06:38:29 > Task :buildSrc:compileTestGroovy NO-SOURCE
01-May-2020 06:38:29 > Task :buildSrc:processTestResources NO-SOURCE
01-May-2020 06:38:29 > Task :buildSrc:testClasses UP-TO-DATE
01-May-2020 06:38:29 > Task :buildSrc:test NO-SOURCE
01-May-2020 06:38:29 > Task :buildSrc:validateTaskProperties
01-May-2020 06:38:29 > Task :buildSrc:check
01-May-2020 06:38:29 > Task :buildSrc:build
01-May-2020 06:38:33
01-May-2020 06:38:33 FAILURE: Build failed with an exception.
01-May-2020 06:38:33
01-May-2020 06:38:33 * Where:
01-May-2020 06:38:33 Build file '/opt/bamboo-home/xml-data/build-dir/SWF-B25X-JOB1/build.gradle' line: 28
01-May-2020 06:38:33
01-May-2020 06:38:33 * What went wrong:
01-May-2020 06:38:33 A problem occurred evaluating root project 'webflow'.
01-May-2020 06:38:33 > Could not find implementation class 'org.springframework.build.optional.OptionalDependenciesPlugin' for plugin 'org.springframework.build.optional-dependencies' specified in jar:file:/opt/users/bamboo/.gradle/caches/jars-3/12b19132409487cfe64889dd857fb468/buildSrc.jar!/META-INF/gradle-plugins/org.springframework.build.optional-dependencies.properties.
01-May-2020 06:38:33
01-May-2020 06:38:33 * Try:
01-May-2020 06:38:33 Run with --info or --debug option to get more log output. Run with --scan to get full insights.
01-May-2020 06:38:33
01-May-2020 06:38:33 * Exception is:
01-May-2020 06:38:33 org.gradle.api.GradleScriptException: A problem occurred evaluating root project 'webflow'.
01-May-2020 06:38:33         at org.gradle.groovy.scripts.internal.DefaultScriptRunnerFactory$ScriptRunnerImpl.run(DefaultScriptRunnerFactory.java:93)
01-May-2020 06:38:33         at org.gradle.configuration.DefaultScriptPluginFactory$ScriptPluginImpl$2.run(DefaultScriptPluginFactory.java:227)
01-May-2020 06:38:33         at org.gradle.configuration.ProjectScriptTarget.addConfiguration(ProjectScriptTarget.java:77)
01-May-2020 06:38:33         at org.gradle.configuration.DefaultScriptPluginFactory$ScriptPluginImpl.apply(DefaultScriptPluginFactory.java:232)
01-May-2020 06:38:33         at org.gradle.configuration.BuildOperationScriptPlugin$1$1.run(BuildOperationScriptPlugin.java:69)
01-May-2020 06:38:33         at org.gradle.internal.operations.DefaultBuildOperationExecutor$RunnableBuildOperationWorker.execute(DefaultBuildOperationExecutor.java:402)
01-May-2020 06:38:33         at org.gradle.internal.operations.DefaultBuildOperationExecutor$RunnableBuildOperationWorker.execute(DefaultBuildOperationExecutor.java:394)
01-May-2020 06:38:33         at org.gradle.internal.operations.DefaultBuildOperationExecutor$1.execute(DefaultBuildOperationExecutor.java:165)
01-May-2020 06:38:33         at org.gradle.internal.operations.DefaultBuildOperationExecutor.execute(DefaultBuildOperationExecutor.java:250)
01-May-2020 06:38:33         at org.gradle.internal.operations.DefaultBuildOperationExecutor.execute(DefaultBuildOperationExecutor.java:158)
01-May-2020 06:38:33         at org.gradle.internal.operations.DefaultBuildOperationExecutor.run(DefaultBuildOperationExecutor.java:92)
01-May-2020 06:38:33         at org.gradle.internal.operations.DelegatingBuildOperationExecutor.run(DelegatingBuildOperationExecutor.java:31)
01-May-2020 06:38:33         at org.gradle.configuration.BuildOperationScriptPlugin$1.execute(BuildOperationScriptPlugin.java:66)
01-May-2020 06:38:33         at org.gradle.configuration.BuildOperationScriptPlugin$1.execute(BuildOperationScriptPlugin.java:63)
01-May-2020 06:38:33         at org.gradle.configuration.internal.DefaultUserCodeApplicationContext.apply(DefaultUserCodeApplicationContext.java:49)
01-May-2020 06:38:33         at org.gradle.configuration.BuildOperationScriptPlugin.apply(BuildOperationScriptPlugin.java:63)
01-May-2020 06:38:33         at org.gradle.configuration.project.BuildScriptProcessor$1.run(BuildScriptProcessor.java:45)
01-May-2020 06:38:33         at org.gradle.internal.Factories$1.create(Factories.java:26)
01-May-2020 06:38:33         at org.gradle.api.internal.project.DefaultProjectStateRegistry$ProjectStateImpl.withMutableState(DefaultProjectStateRegistry.java:201)
01-May-2020 06:38:33         at org.gradle.api.internal.project.DefaultProjectStateRegistry$ProjectStateImpl.withMutableState(DefaultProjectStateRegistry.java:187)
01-May-2020 06:38:33         at org.gradle.configuration.project.BuildScriptProcessor.execute(BuildScriptProcessor.java:42)
01-May-2020 06:38:33         at org.gradle.configuration.project.BuildScriptProcessor.execute(BuildScriptProcessor.java:26)
01-May-2020 06:38:33         at org.gradle.configuration.project.ConfigureActionsProjectEvaluator.evaluate(ConfigureActionsProjectEvaluator.java:35)
01-May-2020 06:38:33         at org.gradle.configuration.project.LifecycleProjectEvaluator$EvaluateProject$1.run(LifecycleProjectEvaluator.java:107)
01-May-2020 06:38:33         at org.gradle.internal.Factories$1.create(Factories.java:26)
01-May-2020 06:38:33         at org.gradle.internal.work.DefaultWorkerLeaseService.withLocks(DefaultWorkerLeaseService.java:189)
01-May-2020 06:38:33         at org.gradle.internal.work.StopShieldingWorkerLeaseService.withLocks(StopShieldingWorkerLeaseService.java:40)
01-May-2020 06:38:33         at org.gradle.api.internal.project.DefaultProjectStateRegistry$ProjectStateImpl.withProjectLock(DefaultProjectStateRegistry.java:227)
01-May-2020 06:38:33         at org.gradle.api.internal.project.DefaultProjectStateRegistry$ProjectStateImpl.withMutableState(DefaultProjectStateRegistry.java:221)
01-May-2020 06:38:33         at org.gradle.api.internal.project.DefaultProjectStateRegistry$ProjectStateImpl.withMutableState(DefaultProjectStateRegistry.java:187)
01-May-2020 06:38:33         at org.gradle.configuration.project.LifecycleProjectEvaluator$EvaluateProject.run(LifecycleProjectEvaluator.java:96)
01-May-2020 06:38:33         at org.gradle.internal.operations.DefaultBuildOperationExecutor$RunnableBuildOperationWorker.execute(DefaultBuildOperationExecutor.java:402)
01-May-2020 06:38:33         at org.gradle.internal.operations.DefaultBuildOperationExecutor$RunnableBuildOperationWorker.execute(DefaultBuildOperationExecutor.java:394)
01-May-2020 06:38:33         at org.gradle.internal.operations.DefaultBuildOperationExecutor$1.execute(DefaultBuildOperationExecutor.java:165)
01-May-2020 06:38:33         at org.gradle.internal.operations.DefaultBuildOperationExecutor.execute(DefaultBuildOperationExecutor.java:250)
01-May-2020 06:38:33         at org.gradle.internal.operations.DefaultBuildOperationExecutor.execute(DefaultBuildOperationExecutor.java:158)
01-May-2020 06:38:33         at org.gradle.internal.operations.DefaultBuildOperationExecutor.run(DefaultBuildOperationExecutor.java:92)
01-May-2020 06:38:33         at org.gradle.internal.operations.DelegatingBuildOperationExecutor.run(DelegatingBuildOperationExecutor.java:31)
01-May-2020 06:38:33         at org.gradle.configuration.project.LifecycleProjectEvaluator.evaluate(LifecycleProjectEvaluator.java:68)
01-May-2020 06:38:33         at org.gradle.api.internal.project.DefaultProject.evaluate(DefaultProject.java:693)
01-May-2020 06:38:33         at org.gradle.api.internal.project.DefaultProject.evaluate(DefaultProject.java:141)
01-May-2020 06:38:33         at org.gradle.execution.TaskPathProjectEvaluator.configure(TaskPathProjectEvaluator.java:36)
01-May-2020 06:38:33         at org.gradle.execution.TaskPathProjectEvaluator.configureHierarchy(TaskPathProjectEvaluator.java:62)
01-May-2020 06:38:33         at org.gradle.configuration.DefaultProjectsPreparer.prepareProjects(DefaultProjectsPreparer.java:55)
01-May-2020 06:38:33         at org.gradle.configuration.BuildOperatingFiringProjectsPreparer$ConfigureBuild.run(BuildOperatingFiringProjectsPreparer.java:52)
01-May-2020 06:38:33         at org.gradle.internal.operations.DefaultBuildOperationExecutor$RunnableBuildOperationWorker.execute(DefaultBuildOperationExecutor.java:402)
01-May-2020 06:38:33         at org.gradle.internal.operations.DefaultBuildOperationExecutor$RunnableBuildOperationWorker.execute(DefaultBuildOperationExecutor.java:394)
01-May-2020 06:38:33         at org.gradle.internal.operations.DefaultBuildOperationExecutor$1.execute(DefaultBuildOperationExecutor.java:165)
01-May-2020 06:38:33         at org.gradle.internal.operations.DefaultBuildOperationExecutor.execute(DefaultBuildOperationExecutor.java:250)
01-May-2020 06:38:33         at org.gradle.internal.operations.DefaultBuildOperationExecutor.execute(DefaultBuildOperationExecutor.java:158)
01-May-2020 06:38:33         at org.gradle.internal.operations.DefaultBuildOperationExecutor.run(DefaultBuildOperationExecutor.java:92)
01-May-2020 06:38:33         at org.gradle.internal.operations.DelegatingBuildOperationExecutor.run(DelegatingBuildOperationExecutor.java:31)
01-May-2020 06:38:33         at org.gradle.configuration.BuildOperatingFiringProjectsPreparer.prepareProjects(BuildOperatingFiringProjectsPreparer.java:40)
01-May-2020 06:38:33         at org.gradle.initialization.DefaultGradleLauncher.prepareProjects(DefaultGradleLauncher.java:198)
01-May-2020 06:38:33         at org.gradle.initialization.DefaultGradleLauncher.doClassicBuildStages(DefaultGradleLauncher.java:138)
01-May-2020 06:38:33         at org.gradle.initialization.DefaultGradleLauncher.doBuildStages(DefaultGradleLauncher.java:126)
01-May-2020 06:38:33         at org.gradle.initialization.DefaultGradleLauncher.executeTasks(DefaultGradleLauncher.java:106)
01-May-2020 06:38:33         at org.gradle.internal.invocation.GradleBuildController$1.execute(GradleBuildController.java:60)
01-May-2020 06:38:33         at org.gradle.internal.invocation.GradleBuildController$1.execute(GradleBuildController.java:57)
01-May-2020 06:38:33         at org.gradle.internal.invocation.GradleBuildController$3.create(GradleBuildController.java:85)
01-May-2020 06:38:33         at org.gradle.internal.invocation.GradleBuildController$3.create(GradleBuildController.java:78)
01-May-2020 06:38:33         at org.gradle.internal.work.DefaultWorkerLeaseService.withLocks(DefaultWorkerLeaseService.java:189)
01-May-2020 06:38:33         at org.gradle.internal.work.StopShieldingWorkerLeaseService.withLocks(StopShieldingWorkerLeaseService.java:40)
01-May-2020 06:38:33         at org.gradle.internal.invocation.GradleBuildController.doBuild(GradleBuildController.java:78)
01-May-2020 06:38:33         at org.gradle.internal.invocation.GradleBuildController.run(GradleBuildController.java:57)
01-May-2020 06:38:33         at org.gradle.tooling.internal.provider.ExecuteBuildActionRunner.run(ExecuteBuildActionRunner.java:31)
01-May-2020 06:38:33         at org.gradle.launcher.exec.ChainingBuildActionRunner.run(ChainingBuildActionRunner.java:35)
01-May-2020 06:38:33         at org.gradle.launcher.exec.BuildOutcomeReportingBuildActionRunner.run(BuildOutcomeReportingBuildActionRunner.java:63)
01-May-2020 06:38:33         at org.gradle.tooling.internal.provider.ValidatingBuildActionRunner.run(ValidatingBuildActionRunner.java:32)
01-May-2020 06:38:33         at org.gradle.launcher.exec.BuildCompletionNotifyingBuildActionRunner.run(BuildCompletionNotifyingBuildActionRunner.java:39)
01-May-2020 06:38:33         at org.gradle.launcher.exec.RunAsBuildOperationBuildActionRunner$3.call(RunAsBuildOperationBuildActionRunner.java:51)
01-May-2020 06:38:33         at org.gradle.launcher.exec.RunAsBuildOperationBuildActionRunner$3.call(RunAsBuildOperationBuildActionRunner.java:45)
01-May-2020 06:38:33         at org.gradle.internal.operations.DefaultBuildOperationExecutor$CallableBuildOperationWorker.execute(DefaultBuildOperationExecutor.java:416)
01-May-2020 06:38:33         at org.gradle.internal.operations.DefaultBuildOperationExecutor$CallableBuildOperationWorker.execute(DefaultBuildOperationExecutor.java:406)
01-May-2020 06:38:33         at org.gradle.internal.operations.DefaultBuildOperationExecutor$1.execute(DefaultBuildOperationExecutor.java:165)
01-May-2020 06:38:33         at org.gradle.internal.operations.DefaultBuildOperationExecutor.execute(DefaultBuildOperationExecutor.java:250)
01-May-2020 06:38:33         at org.gradle.internal.operations.DefaultBuildOperationExecutor.execute(DefaultBuildOperationExecutor.java:158)
01-May-2020 06:38:33         at org.gradle.internal.operations.DefaultBuildOperationExecutor.call(DefaultBuildOperationExecutor.java:102)
01-May-2020 06:38:33         at org.gradle.internal.operations.DelegatingBuildOperationExecutor.call(DelegatingBuildOperationExecutor.java:36)
01-May-2020 06:38:33         at org.gradle.launcher.exec.RunAsBuildOperationBuildActionRunner.run(RunAsBuildOperationBuildActionRunner.java:45)
01-May-2020 06:38:33         at org.gradle.launcher.exec.InProcessBuildActionExecuter$1.transform(InProcessBuildActionExecuter.java:50)
01-May-2020 06:38:33         at org.gradle.launcher.exec.InProcessBuildActionExecuter$1.transform(InProcessBuildActionExecuter.java:47)
01-May-2020 06:38:33         at org.gradle.composite.internal.DefaultRootBuildState.run(DefaultRootBuildState.java:78)
01-May-2020 06:38:33         at org.gradle.launcher.exec.InProcessBuildActionExecuter.execute(InProcessBuildActionExecuter.java:47)
01-May-2020 06:38:33         at org.gradle.launcher.exec.InProcessBuildActionExecuter.execute(InProcessBuildActionExecuter.java:31)
01-May-2020 06:38:33         at org.gradle.launcher.exec.BuildTreeScopeBuildActionExecuter.execute(BuildTreeScopeBuildActionExecuter.java:42)
01-May-2020 06:38:33         at org.gradle.launcher.exec.BuildTreeScopeBuildActionExecuter.execute(BuildTreeScopeBuildActionExecuter.java:28)
01-May-2020 06:38:33         at org.gradle.tooling.internal.provider.ContinuousBuildActionExecuter.execute(ContinuousBuildActionExecuter.java:78)
01-May-2020 06:38:33         at org.gradle.tooling.internal.provider.ContinuousBuildActionExecuter.execute(ContinuousBuildActionExecuter.java:52)
01-May-2020 06:38:33         at org.gradle.tooling.internal.provider.SubscribableBuildActionExecuter.execute(SubscribableBuildActionExecuter.java:59)
01-May-2020 06:38:33         at org.gradle.tooling.internal.provider.SubscribableBuildActionExecuter.execute(SubscribableBuildActionExecuter.java:36)
01-May-2020 06:38:33         at org.gradle.tooling.internal.provider.SessionScopeBuildActionExecuter.execute(SessionScopeBuildActionExecuter.java:68)
01-May-2020 06:38:33         at org.gradle.tooling.internal.provider.SessionScopeBuildActionExecuter.execute(SessionScopeBuildActionExecuter.java:38)
01-May-2020 06:38:33         at org.gradle.tooling.internal.provider.GradleThreadBuildActionExecuter.execute(GradleThreadBuildActionExecuter.java:37)
01-May-2020 06:38:33         at org.gradle.tooling.internal.provider.GradleThreadBuildActionExecuter.execute(GradleThreadBuildActionExecuter.java:26)
01-May-2020 06:38:33         at org.gradle.tooling.internal.provider.ParallelismConfigurationBuildActionExecuter.execute(ParallelismConfigurationBuildActionExecuter.java:43)
01-May-2020 06:38:33         at org.gradle.tooling.internal.provider.ParallelismConfigurationBuildActionExecuter.execute(ParallelismConfigurationBuildActionExecuter.java:29)
01-May-2020 06:38:33         at org.gradle.tooling.internal.provider.StartParamsValidatingActionExecuter.execute(StartParamsValidatingActionExecuter.java:60)
01-May-2020 06:38:33         at org.gradle.tooling.internal.provider.StartParamsValidatingActionExecuter.execute(StartParamsValidatingActionExecuter.java:32)
01-May-2020 06:38:33         at org.gradle.tooling.internal.provider.SessionFailureReportingActionExecuter.execute(SessionFailureReportingActionExecuter.java:55)
01-May-2020 06:38:33         at org.gradle.tooling.internal.provider.SessionFailureReportingActionExecuter.execute(SessionFailureReportingActionExecuter.java:41)
01-May-2020 06:38:33         at org.gradle.tooling.internal.provider.SetupLoggingActionExecuter.execute(SetupLoggingActionExecuter.java:48)
01-May-2020 06:38:33         at org.gradle.tooling.internal.provider.SetupLoggingActionExecuter.execute(SetupLoggingActionExecuter.java:32)
01-May-2020 06:38:33         at org.gradle.launcher.cli.RunBuildAction.run(RunBuildAction.java:56)
01-May-2020 06:38:33         at org.gradle.internal.Actions$RunnableActionAdapter.execute(Actions.java:212)
01-May-2020 06:38:33         at org.gradle.launcher.cli.DefaultCommandLineActionFactory$ParseAndBuildAction.execute(DefaultCommandLineActionFactory.java:404)
01-May-2020 06:38:33         at org.gradle.launcher.cli.DefaultCommandLineActionFactory$ParseAndBuildAction.execute(DefaultCommandLineActionFactory.java:376)
01-May-2020 06:38:33         at org.gradle.launcher.cli.ExceptionReportingAction.execute(ExceptionReportingAction.java:38)
01-May-2020 06:38:33         at org.gradle.launcher.cli.ExceptionReportingAction.execute(ExceptionReportingAction.java:23)
01-May-2020 06:38:33         at org.gradle.launcher.cli.DefaultCommandLineActionFactory$WithLogging.execute(DefaultCommandLineActionFactory.java:369)
01-May-2020 06:38:33         at org.gradle.launcher.Main.doAction(Main.java:35)
01-May-2020 06:38:33         at org.gradle.launcher.bootstrap.EntryPoint.run(EntryPoint.java:45)
01-May-2020 06:38:33         at org.gradle.launcher.bootstrap.ProcessBootstrap.runNoExit(ProcessBootstrap.java:60)
01-May-2020 06:38:33         at org.gradle.launcher.bootstrap.ProcessBootstrap.run(ProcessBootstrap.java:37)
01-May-2020 06:38:33         at org.gradle.launcher.GradleMain.main(GradleMain.java:31)
01-May-2020 06:38:33         at org.gradle.wrapper.BootstrapMainStarter.start(BootstrapMainStarter.java:31)
01-May-2020 06:38:33         at org.gradle.wrapper.WrapperExecutor.execute(WrapperExecutor.java:108)
01-May-2020 06:38:33         at org.gradle.wrapper.GradleWrapperMain.main(GradleWrapperMain.java:63)
01-May-2020 06:38:33 Caused by: org.gradle.api.plugins.InvalidPluginException: Could not find implementation class 'org.springframework.build.optional.OptionalDependenciesPlugin' for plugin 'org.springframework.build.optional-dependencies' specified in jar:file:/opt/users/bamboo/.gradle/caches/jars-3/12b19132409487cfe64889dd857fb468/buildSrc.jar!/META-INF/gradle-plugins/org.springframework.build.optional-dependencies.properties.
01-May-2020 06:38:33         at org.gradle.api.internal.plugins.DefaultPluginRegistry$1.load(DefaultPluginRegistry.java:73)
01-May-2020 06:38:33         at org.gradle.api.internal.plugins.DefaultPluginRegistry$1.load(DefaultPluginRegistry.java:51)
01-May-2020 06:38:33         at com.google.common.cache.LocalCache$LoadingValueReference.loadFuture(LocalCache.java:3445)
01-May-2020 06:38:33         at com.google.common.cache.LocalCache$Segment.loadSync(LocalCache.java:2194)
01-May-2020 06:38:33         at com.google.common.cache.LocalCache$Segment.lockedGetOrLoad(LocalCache.java:2153)
01-May-2020 06:38:33         at com.google.common.cache.LocalCache$Segment.get(LocalCache.java:2043)
01-May-2020 06:38:33         at com.google.common.cache.LocalCache.get(LocalCache.java:3851)
01-May-2020 06:38:33         at com.google.common.cache.LocalCache.getOrLoad(LocalCache.java:3875)
01-May-2020 06:38:33         at com.google.common.cache.LocalCache$LocalLoadingCache.get(LocalCache.java:4800)
01-May-2020 06:38:33         at org.gradle.api.internal.plugins.DefaultPluginRegistry.uncheckedGet(DefaultPluginRegistry.java:151)
01-May-2020 06:38:33         at org.gradle.api.internal.plugins.DefaultPluginRegistry.lookup(DefaultPluginRegistry.java:146)
01-May-2020 06:38:33         at org.gradle.api.internal.plugins.DefaultPluginRegistry.lookup(DefaultPluginRegistry.java:129)
01-May-2020 06:38:33         at org.gradle.api.internal.plugins.DefaultPluginRegistry.lookup(DefaultPluginRegistry.java:123)
01-May-2020 06:38:33         at org.gradle.api.internal.plugins.DefaultPluginManager.apply(DefaultPluginManager.java:132)
01-May-2020 06:38:33         at org.gradle.api.internal.plugins.DefaultObjectConfigurationAction.applyType(DefaultObjectConfigurationAction.java:129)
01-May-2020 06:38:33         at org.gradle.api.internal.plugins.DefaultObjectConfigurationAction.access$200(DefaultObjectConfigurationAction.java:38)
01-May-2020 06:38:33         at org.gradle.api.internal.plugins.DefaultObjectConfigurationAction$3.run(DefaultObjectConfigurationAction.java:93)
01-May-2020 06:38:33         at org.gradle.api.internal.plugins.DefaultObjectConfigurationAction.execute(DefaultObjectConfigurationAction.java:152)
01-May-2020 06:38:33         at org.gradle.api.internal.project.AbstractPluginAware.apply(AbstractPluginAware.java:49)
01-May-2020 06:38:33         at org.gradle.internal.metaobject.BeanDynamicObject$MetaClassAdapter.invokeMethod(BeanDynamicObject.java:479)
01-May-2020 06:38:33         at org.gradle.internal.metaobject.BeanDynamicObject.tryInvokeMethod(BeanDynamicObject.java:191)
01-May-2020 06:38:33         at org.gradle.internal.metaobject.CompositeDynamicObject.tryInvokeMethod(CompositeDynamicObject.java:98)
01-May-2020 06:38:33         at org.gradle.internal.extensibility.MixInClosurePropertiesAsMethodsDynamicObject.tryInvokeMethod(MixInClosurePropertiesAsMethodsDynamicObject.java:33)
01-May-2020 06:38:33         at org.gradle.internal.metaobject.ConfigureDelegate.invokeMethod(ConfigureDelegate.java:56)
01-May-2020 06:38:33         at build_2hm0on41jrwe42ah7rrhsyctg$_run_closure2.doCall(/opt/bamboo-home/xml-data/build-dir/SWF-B25X-JOB1/build.gradle:28)
01-May-2020 06:38:33         at org.gradle.util.ClosureBackedAction.execute(ClosureBackedAction.java:71)
01-May-2020 06:38:33         at org.gradle.util.ConfigureUtil.configureTarget(ConfigureUtil.java:154)
01-May-2020 06:38:33         at org.gradle.util.ConfigureUtil.configure(ConfigureUtil.java:105)
01-May-2020 06:38:33         at org.gradle.util.ConfigureUtil$WrappedConfigureAction.execute(ConfigureUtil.java:166)
01-May-2020 06:38:33         at org.gradle.api.internal.DefaultMutationGuard$2.execute(DefaultMutationGuard.java:42)
01-May-2020 06:38:33         at org.gradle.internal.Actions.with(Actions.java:251)
01-May-2020 06:38:33         at org.gradle.api.internal.project.BuildOperationCrossProjectConfigurator$2$1.run(BuildOperationCrossProjectConfigurator.java:79)
01-May-2020 06:38:33         at org.gradle.internal.operations.DefaultBuildOperationExecutor$RunnableBuildOperationWorker.execute(DefaultBuildOperationExecutor.java:402)
01-May-2020 06:38:33         at org.gradle.internal.operations.DefaultBuildOperationExecutor$RunnableBuildOperationWorker.execute(DefaultBuildOperationExecutor.java:394)
01-May-2020 06:38:33         at org.gradle.internal.operations.DefaultBuildOperationExecutor$1.execute(DefaultBuildOperationExecutor.java:165)
01-May-2020 06:38:33         at org.gradle.internal.operations.DefaultBuildOperationExecutor.execute(DefaultBuildOperationExecutor.java:250)
01-May-2020 06:38:33         at org.gradle.internal.operations.DefaultBuildOperationExecutor.execute(DefaultBuildOperationExecutor.java:158)
01-May-2020 06:38:33         at org.gradle.internal.operations.DefaultBuildOperationExecutor.run(DefaultBuildOperationExecutor.java:92)
01-May-2020 06:38:33         at org.gradle.internal.operations.DelegatingBuildOperationExecutor.run(DelegatingBuildOperationExecutor.java:31)
01-May-2020 06:38:33         at org.gradle.api.internal.project.BuildOperationCrossProjectConfigurator$2.run(BuildOperationCrossProjectConfigurator.java:76)
01-May-2020 06:38:33         at org.gradle.internal.Factories$1.create(Factories.java:26)
01-May-2020 06:38:33         at org.gradle.api.internal.project.DefaultProjectStateRegistry$ProjectStateImpl.withMutableState(DefaultProjectStateRegistry.java:201)
01-May-2020 06:38:33         at org.gradle.api.internal.project.DefaultProjectStateRegistry$ProjectStateImpl.withMutableState(DefaultProjectStateRegistry.java:187)
01-May-2020 06:38:33         at org.gradle.api.internal.project.BuildOperationCrossProjectConfigurator.runProjectConfigureAction(BuildOperationCrossProjectConfigurator.java:73)
01-May-2020 06:38:33         at org.gradle.api.internal.project.BuildOperationCrossProjectConfigurator.access$400(BuildOperationCrossProjectConfigurator.java:32)
01-May-2020 06:38:33         at org.gradle.api.internal.project.BuildOperationCrossProjectConfigurator$1.doRunProjectConfigure(BuildOperationCrossProjectConfigurator.java:67)
01-May-2020 06:38:33         at org.gradle.api.internal.project.BuildOperationCrossProjectConfigurator$BlockConfigureBuildOperation.run(BuildOperationCrossProjectConfigurator.java:121)
01-May-2020 06:38:33         at org.gradle.internal.operations.DefaultBuildOperationExecutor$RunnableBuildOperationWorker.execute(DefaultBuildOperationExecutor.java:402)
01-May-2020 06:38:33         at org.gradle.internal.operations.DefaultBuildOperationExecutor$RunnableBuildOperationWorker.execute(DefaultBuildOperationExecutor.java:394)
01-May-2020 06:38:33         at org.gradle.internal.operations.DefaultBuildOperationExecutor$1.execute(DefaultBuildOperationExecutor.java:165)
01-May-2020 06:38:33         at org.gradle.internal.operations.DefaultBuildOperationExecutor.execute(DefaultBuildOperationExecutor.java:250)
01-May-2020 06:38:33         at org.gradle.internal.operations.DefaultBuildOperationExecutor.execute(DefaultBuildOperationExecutor.java:158)
01-May-2020 06:38:33         at org.gradle.internal.operations.DefaultBuildOperationExecutor.run(DefaultBuildOperationExecutor.java:92)
01-May-2020 06:38:33         at org.gradle.internal.operations.DelegatingBuildOperationExecutor.run(DelegatingBuildOperationExecutor.java:31)
01-May-2020 06:38:33         at org.gradle.api.internal.project.BuildOperationCrossProjectConfigurator.runBlockConfigureAction(BuildOperationCrossProjectConfigurator.java:64)
01-May-2020 06:38:33         at org.gradle.api.internal.project.BuildOperationCrossProjectConfigurator.allprojects(BuildOperationCrossProjectConfigurator.java:54)
01-May-2020 06:38:33         at org.gradle.api.internal.project.DefaultProject.allprojects(DefaultProject.java:1154)
01-May-2020 06:38:33         at org.gradle.internal.metaobject.BeanDynamicObject$MetaClassAdapter.invokeMethod(BeanDynamicObject.java:479)
01-May-2020 06:38:33         at org.gradle.internal.metaobject.BeanDynamicObject.tryInvokeMethod(BeanDynamicObject.java:191)
01-May-2020 06:38:33         at org.gradle.internal.metaobject.CompositeDynamicObject.tryInvokeMethod(CompositeDynamicObject.java:98)
01-May-2020 06:38:33         at org.gradle.internal.extensibility.MixInClosurePropertiesAsMethodsDynamicObject.tryInvokeMethod(MixInClosurePropertiesAsMethodsDynamicObject.java:33)
01-May-2020 06:38:33         at org.gradle.groovy.scripts.BasicScript$ScriptDynamicObject.tryInvokeMethod(BasicScript.java:134)
01-May-2020 06:38:33         at org.gradle.internal.metaobject.AbstractDynamicObject.invokeMethod(AbstractDynamicObject.java:162)
01-May-2020 06:38:33         at org.gradle.groovy.scripts.BasicScript.invokeMethod(BasicScript.java:83)
01-May-2020 06:38:33         at build_2hm0on41jrwe42ah7rrhsyctg.run(/opt/bamboo-home/xml-data/build-dir/SWF-B25X-JOB1/build.gradle:23)
01-May-2020 06:38:33         at org.gradle.groovy.scripts.internal.DefaultScriptRunnerFactory$ScriptRunnerImpl.run(DefaultScriptRunnerFactory.java:91)
01-May-2020 06:38:33         ... 117 more
01-May-2020 06:38:33 Caused by: java.lang.ClassNotFoundException: org.springframework.build.optional.OptionalDependenciesPlugin
01-May-2020 06:38:33         at org.gradle.api.internal.plugins.DefaultPluginRegistry$1.load(DefaultPluginRegistry.java:71)
01-May-2020 06:38:33         ... 182 more
01-May-2020 06:38:33
01-May-2020 06:38:33
01-May-2020 06:38:33 * Get more help at https://help.gradle.org
01-May-2020 06:38:33
01-May-2020 06:38:33 BUILD FAILED in 7s
01-May-2020 06:38:33
01-May-2020 06:38:33 Failing task since return code of [./gradlew --refresh-dependencies --no-daemon -PtestGroups=ci -P BRANCH_NAME=master --stacktrace clean build -I /tmp/artifactory.init.script4175298378867019279gradle -DbuildInfoConfig.propertiesFile=/tmp/buildinfo2938720340432586882properties artifactoryPublish -Dartifactory.resolve.password=******** -Dartifactory.publish.password=********] was 1 while expected 0
01-May-2020 06:38:33 Parsing test results under /opt/bamboo-home/xml-data/build-dir/SWF-B25X-JOB1...
01-May-2020 06:38:33 Finished task 'Artifactory Gradle' with result: Failed
01-May-2020 06:38:33 Running post build plugin 'Docker Container Cleanup'
01-May-2020 06:38:33 Running post build plugin 'NCover Results Collector'
01-May-2020 06:38:33 Running post build plugin 'Artifactory Release Management Staging'
01-May-2020 06:38:33 Running post build plugin 'Artifactory Build Info Copier'
01-May-2020 06:38:33 Running post build plugin 'Artifactory Gradle Properties Info Copier'
01-May-2020 06:38:33 Running post build plugin 'Clover Results Collector'
01-May-2020 06:38:33 Running post build plugin 'npm Cache Cleanup'
01-May-2020 06:38:33 Running post build plugin 'Artifact Copier'
01-May-2020 06:38:33 Successfully removed working directory at '/opt/bamboo-home/xml-data/build-dir/SWF-B25X-JOB1'
01-May-2020 06:38:33 Finalising the build...
01-May-2020 06:38:33 Stopping timer.
01-May-2020 06:38:33 Build SWF-B25X-JOB1-63 completed.
01-May-2020 06:38:33 Running on server: post build plugin 'NCover Results Collector'
01-May-2020 06:38:33 Running on server: post build plugin 'Build Hanging Detection Configuration'
01-May-2020 06:38:33 Running on server: post build plugin 'Bamboo project link creator'
01-May-2020 06:38:33 Running on server: post build plugin 'Clover Delta Calculator'
01-May-2020 06:38:33 Running on server: post build plugin 'Maven Dependencies Postprocessor'
01-May-2020 06:38:33 All post build plugins have finished
01-May-2020 06:38:33 Generating build results summary...
01-May-2020 06:38:33 Saving build results to disk...
01-May-2020 06:38:33 Logging substituted variables...
01-May-2020 06:38:33 Indexing build results...
01-May-2020 06:38:33 Finished building SWF-B25X-JOB1-63.