Spring Web Flow 2.4.x

Build result summary

Details

Completed
Duration
1 minute
Labels
None
Agent
bamboo-24.af.pivotal.io
Revision
0e0587f0409b96b3f065e17863168ecb46fa945f 0e0587f0409b96b3f065e17863168ecb46fa945f
Total tests
286
Fixed in
#208 (Changes by Rossen Stoyanchev)

Tests

Responsible

No one has taken responsibility for this failure

Code commits

Author Commit Message Commit date
Spring Operator <spring-operator@users.noreply.github.com> Spring Operator <spring-operator@users.noreply.github.com> 0e0587f0409b96b3f065e17863168ecb46fa945f 0e0587f0409b96b3f065e17863168ecb46fa945f URL Cleanup
This commit updates URLs to prefer the https protocol. Redirects are not followed to avoid accidentally expanding intentionally shortened URLs (i.e. if using a URL shortener).

# HTTP URLs that Could Not Be Fixed
These URLs were unable to be fixed. Please review them to see if they can be manually resolved.

* [ ] http://joda-time.sourceforge.net/ (200) with 1 occurrences could not be migrated:
   ([https](https://joda-time.sourceforge.net/) result AnnotatedConnectException).
* [ ] http://saxon.sourceforge.net/ (200) with 1 occurrences could not be migrated:
   ([https](https://saxon.sourceforge.net/) result AnnotatedConnectException).
* [ ] http://www.jjg.net/ia/visvocab/ (200) with 1 occurrences could not be migrated:
   ([https](https://www.jjg.net/ia/visvocab/) result AnnotatedConnectException).

# Fixed URLs

## Fixed But Review Recommended
These URLs were fixed, but the https status was not OK. However, the https status was the same as the http request or http redirected to an https URL, so they were migrated. Your review is recommended.

* [ ] http://www.w3.org/TR/xhtml1/DTD/xhtml1-transitional.dtd (ReadTimeoutException) with 2 occurrences migrated to:
  https://www.w3.org/TR/xhtml1/DTD/xhtml1-transitional.dtd ([https](https://www.w3.org/TR/xhtml1/DTD/xhtml1-transitional.dtd) result ReadTimeoutException).
* [ ] http://static.springframework.org/spring/docs/current/reference/portlet.html (301) with 1 occurrences migrated to:
  https://docs.spring.io/spring/docs/current/reference/portlet.html ([https](https://static.springframework.org/spring/docs/current/reference/portlet.html) result 404).
* [ ] http://www.ognl.org/2.6.9/Documentation/html/LanguageGuide/index.html (404) with 1 occurrences migrated to:
  https://www.ognl.org/2.6.9/Documentation/html/LanguageGuide/index.html ([https](https://www.ognl.org/2.6.9/Documentation/html/LanguageGuide/index.html) result 404).
* [ ] http://www.springframework.org/schema/faces/spring-faces-2.2.xsd (404) with 1 occurrences migrated to:
  https://www.springframework.org/schema/faces/spring-faces-2.2.xsd ([https](https://www.springframework.org/schema/faces/spring-faces-2.2.xsd) result 404).
* [ ] http://www.springframework.org/schema/faces/spring-faces-2.4.xsd (404) with 3 occurrences migrated to:
  https://www.springframework.org/schema/faces/spring-faces-2.4.xsd ([https](https://www.springframework.org/schema/faces/spring-faces-2.4.xsd) result 404).
* [ ] http://www.springframework.org/schema/webflow-config/spring-webflow-config-2.0.xsd (404) with 1 occurrences migrated to:
  https://www.springframework.org/schema/webflow-config/spring-webflow-config-2.0.xsd ([https](https://www.springframework.org/schema/webflow-config/spring-webflow-config-2.0.xsd) result 404).
* [ ] http://www.springframework.org/schema/webflow-config/spring-webflow-config-2.3.xsd (404) with 2 occurrences migrated to:
  https://www.springframework.org/schema/webflow-config/spring-webflow-config-2.3.xsd ([https](https://www.springframework.org/schema/webflow-config/spring-webflow-config-2.3.xsd) result 404).
* [ ] http://www.springframework.org/schema/webflow-config/spring-webflow-config-2.4.xsd (404) with 4 occurrences migrated to:
  https://www.springframework.org/schema/webflow-config/spring-webflow-config-2.4.xsd ([https](https://www.springframework.org/schema/webflow-config/spring-webflow-config-2.4.xsd) result 404).
* [ ] http://www.springframework.org/schema/webflow/spring-webflow-1.0.xsd (404) with 2 occurrences migrated to:
  https://www.springframework.org/schema/webflow/spring-webflow-1.0.xsd ([https](https://www.springframework.org/schema/webflow/spring-webflow-1.0.xsd) result 404).
* [ ] http://www.springframework.org/schema/webflow/spring-webflow-2.0.xsd (404) with 43 occurrences migrated to:
  https://www.springframework.org/schema/webflow/spring-webflow-2.0.xsd ([https](https://www.springframework.org/schema/webflow/spring-webflow-2.0.xsd) result 404).
* [ ] http://www.springframework.org/schema/webflow/spring-webflow-2.4.xsd (404) with 2 occurrences migrated to:
  https://www.springframework.org/schema/webflow/spring-webflow-2.4.xsd ([https](https://www.springframework.org/schema/webflow/spring-webflow-2.4.xsd) result 404).

## Fixed Success
These URLs were switched to an https URL with a 2xx status. While the status was successful, your review is still recommended.

* [ ] http://static.springframework.org/spring-security/site/reference.html (301) with 2 occurrences migrated to:
  https://docs.spring.io/spring-security/site/reference.html ([https](https://static.springframework.org/spring-security/site/reference.html) result 200).
* [ ] http://static.springsource.org/spring/docs/2.5.x/reference/mvc.html (301) with 1 occurrences migrated to:
  https://docs.spring.io/spring/docs/2.5.x/reference/mvc.html ([https](https://static.springsource.org/spring/docs/2.5.x/reference/mvc.html) result 200).
* [ ] http://static.springsource.org/spring/docs/3.0.x/spring-framework-reference/html/expressions.html (301) with 2 occurrences migrated to:
  https://docs.spring.io/spring/docs/3.0.x/spring-framework-reference/html/expressions.html ([https](https://static.springsource.org/spring/docs/3.0.x/spring-framework-reference/html/expressions.html) result 200).
* [ ] http://static.springsource.org/spring/docs/3.0.x/spring-framework-reference/html/index.html (301) with 1 occurrences migrated to:
  https://docs.spring.io/spring/docs/3.0.x/spring-framework-reference/html/index.html ([https](https://static.springsource.org/spring/docs/3.0.x/spring-framework-reference/html/index.html) result 200).
* [ ] http://static.springsource.org/spring/docs/3.0.x/spring-framework-reference/html/mvc.html (301) with 2 occurrences migrated to:
  https://docs.spring.io/spring/docs/3.0.x/spring-framework-reference/html/mvc.html ([https](https://static.springsource.org/spring/docs/3.0.x/spring-framework-reference/html/mvc.html) result 200).
* [ ] http://static.springsource.org/spring/docs/3.0.x/spring-framework-reference/html/validation.html (301) with 2 occurrences migrated to:
  https://docs.spring.io/spring/docs/3.0.x/spring-framework-reference/html/validation.html ([https](https://static.springsource.org/spring/docs/3.0.x/spring-framework-reference/html/validation.html) result 200).
* [ ] http://en.wikipedia.org/wiki/Unified_Expression_Language with 1 occurrences migrated to:
  https://en.wikipedia.org/wiki/Unified_Expression_Language ([https](https://en.wikipedia.org/wiki/Unified_Expression_Language) result 200).
* [ ] http://hibernate.sourceforge.net/hibernate-mapping-3.0.dtd (301) with 2 occurrences migrated to:
  https://hibernate.org/dtd/hibernate-mapping-3.0.dtd ([https](https://hibernate.sourceforge.net/hibernate-mapping-3.0.dtd) result 200).
* [ ] http://jira.spring.io with 1 occurrences migrated to:
  https://jira.spring.io ([https](https://jira.spring.io) result 200).
* [ ] http://portals.apache.org/pluto/ with 1 occurrences migrated to:
  https://portals.apache.org/pluto/ ([https](https://portals.apache.org/pluto/) result 200).
* [ ] http://primefaces.org/documentation.html with 1 occurrences migrated to:
  https://primefaces.org/documentation.html ([https](https://primefaces.org/documentation.html) result 200).
* [ ] http://repo.spring.io/libs-release/ with 2 occurrences migrated to:
  https://repo.spring.io/libs-release/ ([https](https://repo.spring.io/libs-release/) result 200).
* [ ] http://repository.springsource.com/ivy/bundles/external/ with 2 occurrences migrated to:
  https://repository.springsource.com/ivy/bundles/external/ ([https](https://repository.springsource.com/ivy/bundles/external/) result 200).
* [ ] http://repository.springsource.com/ivy/bundles/release/ with 2 occurrences migrated to:
  https://repository.springsource.com/ivy/bundles/release/ ([https](https://repository.springsource.com/ivy/bundles/release/) result 200).
* [ ] http://search.maven.org with 1 occurrences migrated to:
  https://search.maven.org ([https](https://search.maven.org) result 200).
* [ ] http://tiles.apache.org/ with 1 occurrences migrated to:
  https://tiles.apache.org/ ([https](https://tiles.apache.org/) result 200).
* [ ] http://tiles.apache.org/dtds/tiles-config_2_1.dtd with 1 occurrences migrated to:
  https://tiles.apache.org/dtds/tiles-config_2_1.dtd ([https](https://tiles.apache.org/dtds/tiles-config_2_1.dtd) result 200).
* [ ] http://tiles.apache.org/dtds/tiles-config_3_0.dtd with 1 occurrences migrated to:
  https://tiles.apache.org/dtds/tiles-config_3_0.dtd ([https](https://tiles.apache.org/dtds/tiles-config_3_0.dtd) result 200).
* [ ] http://www.ognl.org with 1 occurrences migrated to:
  https://www.ognl.org ([https](https://www.ognl.org) result 200).
* [ ] http://xmlns.jcp.org/xml/ns/persistence/orm_2_1.xsd (301) with 1 occurrences migrated to:
  https://www.oracle.com/webfolder/technetwork/jsc/xml/ns/persistence/orm_2_1.xsd ([https](https://xmlns.jcp.org/xml/ns/persistence/orm_2_1.xsd) result 200).
* [ ] http://www.springframework.org/schema/beans/spring-beans-2.0.xsd with 1 occurrences migrated to:
  https://www.springframework.org/schema/beans/spring-beans-2.0.xsd ([https](https://www.springframework.org/schema/beans/spring-beans-2.0.xsd) result 200).
* [ ] http://www.springframework.org/schema/beans/spring-beans-2.5.xsd with 1 occurrences migrated to:
  https://www.springframework.org/schema/beans/spring-beans-2.5.xsd ([https](https://www.springframework.org/schema/beans/spring-beans-2.5.xsd) result 200).
* [ ] http://www.springframework.org/schema/beans/spring-beans-4.0.xsd with 8 occurrences migrated to:
  https://www.springframework.org/schema/beans/spring-beans-4.0.xsd ([https](https://www.springframework.org/schema/beans/spring-beans-4.0.xsd) result 200).
* [ ] http://www.springframework.org/schema/beans/spring-beans.xsd with 6 occurrences migrated to:
  https://www.springframework.org/schema/beans/spring-beans.xsd ([https](https://www.springframework.org/schema/beans/spring-beans.xsd) result 200).
* [ ] http://www.springframework.org/schema/mvc/spring-mvc-4.0.xsd with 4 occurrences migrated to:
  https://www.springframework.org/schema/mvc/spring-mvc-4.0.xsd ([https](https://www.springframework.org/schema/mvc/spring-mvc-4.0.xsd) result 200).
* [ ] http://springframework.org with 1 occurrences migrated to:
  https://springframework.org ([https](https://springframework.org) result 301).
* [ ] http://www.docbook.org/xml/5.0/xsd/docbook.xsd with 18 occurrences migrated to:
  https://www.docbook.org/xml/5.0/xsd/docbook.xsd ([https](https://www.docbook.org/xml/5.0/xsd/docbook.xsd) result 301).
* [ ] http://www.docbook.org/xml/5.0/xsd/xlink.xsd with 18 occurrences migrated to:
  https://www.docbook.org/xml/5.0/xsd/xlink.xsd ([https](https://www.docbook.org/xml/5.0/xsd/xlink.xsd) result 301).
* [ ] http://www.jboss.org/richfaces/docs with 1 occurrences migrated to:
  https://www.jboss.org/richfaces/docs ([https](https://www.jboss.org/richfaces/docs) result 301).
* [ ] http://java.sun.com/dtd/facelet-taglib_1_0.dtd with 1 occurrences migrated to:
  https://java.sun.com/dtd/facelet-taglib_1_0.dtd ([https](https://java.sun.com/dtd/facelet-taglib_1_0.dtd) result 302).
* [ ] http://java.sun.com/dtd/web-facesconfig_1_0.dtd with 1 occurrences migrated to:
  https://java.sun.com/dtd/web-facesconfig_1_0.dtd ([https](https://java.sun.com/dtd/web-facesconfig_1_0.dtd) result 302).
* [ ] http://java.sun.com/xml/ns/javaee/web-facesconfig_2_0.xsd with 2 occurrences migrated to:
  https://java.sun.com/xml/ns/javaee/web-facesconfig_2_0.xsd ([https](https://java.sun.com/xml/ns/javaee/web-facesconfig_2_0.xsd) result 302).
* [ ] http://java.sun.com/xml/ns/persistence/persistence_1_0.xsd with 1 occurrences migrated to:
  https://java.sun.com/xml/ns/persistence/persistence_1_0.xsd ([https](https://java.sun.com/xml/ns/persistence/persistence_1_0.xsd) result 302).
* [ ] http://repo.spring.io/snapshot with 1 occurrences migrated to:
  https://repo.spring.io/snapshot ([https](https://repo.spring.io/snapshot) result 302).
* [ ] http://www.paypal.com?_callbackUrl= with 1 occurrences migrated to:
  https://www.paypal.com?_callbackUrl= ([https](https://www.paypal.com?_callbackUrl=) result 302).

# Ignored
These URLs were intentionally ignored.

* http://docbook.org/ns/docbook with 36 occurrences
* http://jakarta.apache.org/log4j/ with 4 occurrences
* http://java.sun.com/jsf/facelets with 2 occurrences
* http://java.sun.com/jsf/html with 2 occurrences
* http://java.sun.com/xml/ns/javaee with 4 occurrences
* http://java.sun.com/xml/ns/persistence with 2 occurrences
* http://localhost/app/hotels/booking?hotelId=1 with 1 occurrences
* http://www.springframework.org/schema/beans with 32 occurrences
* http://www.springframework.org/schema/faces with 8 occurrences
* http://www.springframework.org/schema/mvc with 8 occurrences
* http://www.springframework.org/schema/webflow with 96 occurrences
* http://www.springframework.org/schema/webflow-config with 14 occurrences
* http://www.springframework.org/security/tags with 2 occurrences
* http://www.springframework.org/security/tags&lt;/namespace&gt with 1 occurrences
* http://www.w3.org/1999/xhtml with 2 occurrences
* http://www.w3.org/1999/xlink with 36 occurrences
* http://www.w3.org/2001/XInclude with 35 occurrences
* http://www.w3.org/2001/XMLSchema-instance with 85 occurrences
* http://xmlns.jcp.org/xml/ns/persistence/orm with 2 occurrences

Tests

New test failures 61
Status Test View job Duration
Collapse Failed FacesFlowBuilderServicesBeanDefinitionParserTests testEnableManagedBeans History
Default Job < 1 sec
java.lang.AssertionError: java.lang.AssertionError
java.lang.AssertionError
	at javax.faces.CurrentThreadToServletContext$FactoryManagerCacheKey.initFromFactoryMap(CurrentThreadToServletContext.java:278)
	at javax.faces.CurrentThreadToServletContext$FactoryManagerCacheKey.<init>(CurrentThreadToServletContext.java:256)
	at javax.faces.CurrentThreadToServletContext.getApplicationFactoryManager(CurrentThreadToServletContext.java:104)
	at javax.faces.CurrentThreadToServletContext.getApplicationFactoryManager(CurrentThreadToServletContext.java:97)
	at javax.faces.FactoryFinder.getFactory(FactoryFinder.java:277)
	at javax.faces.context.FacesContext.getCurrentInstance(FacesContext.java:912)
(40 more lines...)
Collapse Failed FacesFlowBuilderServicesBeanDefinitionParserTests testFlowBuilderServicesConversionServiceCustomized History
Default Job < 1 sec
java.lang.AssertionError: java.lang.AssertionError
java.lang.AssertionError
	at javax.faces.CurrentThreadToServletContext$FactoryManagerCacheKey.initFromFactoryMap(CurrentThreadToServletContext.java:278)
	at javax.faces.CurrentThreadToServletContext$FactoryManagerCacheKey.<init>(CurrentThreadToServletContext.java:256)
	at javax.faces.CurrentThreadToServletContext.getApplicationFactoryManager(CurrentThreadToServletContext.java:104)
	at javax.faces.CurrentThreadToServletContext.getApplicationFactoryManager(CurrentThreadToServletContext.java:97)
	at javax.faces.FactoryFinder.getFactory(FactoryFinder.java:277)
	at javax.faces.context.FacesContext.getCurrentInstance(FacesContext.java:912)
(40 more lines...)
Collapse Failed FacesFlowBuilderServicesBeanDefinitionParserTests testConfigureDefaults History
Default Job < 1 sec
java.lang.AssertionError: java.lang.AssertionError
java.lang.AssertionError
	at javax.faces.CurrentThreadToServletContext$FactoryManagerCacheKey.initFromFactoryMap(CurrentThreadToServletContext.java:278)
	at javax.faces.CurrentThreadToServletContext$FactoryManagerCacheKey.<init>(CurrentThreadToServletContext.java:256)
	at javax.faces.CurrentThreadToServletContext.getApplicationFactoryManager(CurrentThreadToServletContext.java:104)
	at javax.faces.CurrentThreadToServletContext.getApplicationFactoryManager(CurrentThreadToServletContext.java:97)
	at javax.faces.FactoryFinder.getFactory(FactoryFinder.java:277)
	at javax.faces.context.FacesContext.getCurrentInstance(FacesContext.java:912)
(40 more lines...)
Collapse Failed FacesFlowBuilderServicesBeanDefinitionParserTests testFlowBuilderServicesAllCustomized History
Default Job < 1 sec
java.lang.AssertionError: java.lang.AssertionError
java.lang.AssertionError
	at javax.faces.CurrentThreadToServletContext$FactoryManagerCacheKey.initFromFactoryMap(CurrentThreadToServletContext.java:278)
	at javax.faces.CurrentThreadToServletContext$FactoryManagerCacheKey.<init>(CurrentThreadToServletContext.java:256)
	at javax.faces.CurrentThreadToServletContext.getApplicationFactoryManager(CurrentThreadToServletContext.java:104)
	at javax.faces.CurrentThreadToServletContext.getApplicationFactoryManager(CurrentThreadToServletContext.java:97)
	at javax.faces.FactoryFinder.getFactory(FactoryFinder.java:277)
	at javax.faces.context.FacesContext.getCurrentInstance(FacesContext.java:912)
(40 more lines...)
Collapse Failed FacesFlowBuilderServicesJavaConfigTests testFlowBuilderServicesConversionServiceCustomized History
Default Job < 1 sec
java.lang.AssertionError: java.lang.AssertionError
java.lang.AssertionError
	at javax.faces.CurrentThreadToServletContext$FactoryManagerCacheKey.initFromFactoryMap(CurrentThreadToServletContext.java:278)
	at javax.faces.CurrentThreadToServletContext$FactoryManagerCacheKey.<init>(CurrentThreadToServletContext.java:256)
	at javax.faces.CurrentThreadToServletContext.getApplicationFactoryManager(CurrentThreadToServletContext.java:104)
	at javax.faces.CurrentThreadToServletContext.getApplicationFactoryManager(CurrentThreadToServletContext.java:97)
	at javax.faces.FactoryFinder.getFactory(FactoryFinder.java:277)
	at javax.faces.context.FacesContext.getCurrentInstance(FacesContext.java:912)
(40 more lines...)
Collapse Failed FacesFlowBuilderServicesJavaConfigTests testConfigureDefaults History
Default Job < 1 sec
java.lang.AssertionError: java.lang.AssertionError
java.lang.AssertionError
	at javax.faces.CurrentThreadToServletContext$FactoryManagerCacheKey.initFromFactoryMap(CurrentThreadToServletContext.java:278)
	at javax.faces.CurrentThreadToServletContext$FactoryManagerCacheKey.<init>(CurrentThreadToServletContext.java:256)
	at javax.faces.CurrentThreadToServletContext.getApplicationFactoryManager(CurrentThreadToServletContext.java:104)
	at javax.faces.CurrentThreadToServletContext.getApplicationFactoryManager(CurrentThreadToServletContext.java:97)
	at javax.faces.FactoryFinder.getFactory(FactoryFinder.java:277)
	at javax.faces.context.FacesContext.getCurrentInstance(FacesContext.java:912)
(40 more lines...)
Collapse Failed FacesFlowBuilderServicesJavaConfigTests testFlowBuilderServicesAllCustomized History
Default Job < 1 sec
java.lang.AssertionError: java.lang.AssertionError
java.lang.AssertionError
	at javax.faces.CurrentThreadToServletContext$FactoryManagerCacheKey.initFromFactoryMap(CurrentThreadToServletContext.java:278)
	at javax.faces.CurrentThreadToServletContext$FactoryManagerCacheKey.<init>(CurrentThreadToServletContext.java:256)
	at javax.faces.CurrentThreadToServletContext.getApplicationFactoryManager(CurrentThreadToServletContext.java:104)
	at javax.faces.CurrentThreadToServletContext.getApplicationFactoryManager(CurrentThreadToServletContext.java:97)
	at javax.faces.FactoryFinder.getFactory(FactoryFinder.java:277)
	at javax.faces.context.FacesContext.getCurrentInstance(FacesContext.java:912)
(40 more lines...)
Collapse Failed FacesFlowBuilderServicesJavaConfigTests testEnableManagedBeans History
Default Job < 1 sec
java.lang.AssertionError: java.lang.AssertionError
java.lang.AssertionError
	at javax.faces.CurrentThreadToServletContext$FactoryManagerCacheKey.initFromFactoryMap(CurrentThreadToServletContext.java:278)
	at javax.faces.CurrentThreadToServletContext$FactoryManagerCacheKey.<init>(CurrentThreadToServletContext.java:256)
	at javax.faces.CurrentThreadToServletContext.getApplicationFactoryManager(CurrentThreadToServletContext.java:104)
	at javax.faces.CurrentThreadToServletContext.getApplicationFactoryManager(CurrentThreadToServletContext.java:97)
	at javax.faces.FactoryFinder.getFactory(FactoryFinder.java:277)
	at javax.faces.context.FacesContext.getCurrentInstance(FacesContext.java:912)
(40 more lines...)
Collapse Failed ResourcesBeanDefinitionParserTests testConfigureDefaults History
Default Job < 1 sec
java.lang.AssertionError: java.lang.AssertionError
java.lang.AssertionError
	at javax.faces.CurrentThreadToServletContext$FactoryManagerCacheKey.initFromFactoryMap(CurrentThreadToServletContext.java:278)
	at javax.faces.CurrentThreadToServletContext$FactoryManagerCacheKey.<init>(CurrentThreadToServletContext.java:256)
	at javax.faces.CurrentThreadToServletContext.getApplicationFactoryManager(CurrentThreadToServletContext.java:104)
	at javax.faces.CurrentThreadToServletContext.getApplicationFactoryManager(CurrentThreadToServletContext.java:91)
	at javax.faces.FactoryFinder.setFactory(FactoryFinder.java:310)
	at org.springframework.faces.webflow.JSFMockHelper$JSFMock.setUp(JSFMockHelper.java:138)
(39 more lines...)
Collapse Failed ResourcesBeanDefinitionParserTests testConfigurePortlet History
Default Job < 1 sec
org.springframework.beans.factory.xml.XmlBeanDefinitionStoreException: org.springframework.beans.factory.xml.XmlBeanDefinitionStoreException: Line 9 in XML document from class path resource [org/springframework/faces/config/resources.xml] is invalid; nested exception is org.xml.sax.SAXParseException; lineNumber: 9; columnNumber: 21; cvc-complex-type.2.4.c: The matching wildcard is strict, but no declaration can be found for element 'faces:resources'.
org.springframework.beans.factory.xml.XmlBeanDefinitionStoreException: Line 9 in XML document from class path resource [org/springframework/faces/config/resources.xml] is invalid; nested exception is org.xml.sax.SAXParseException; lineNumber: 9; columnNumber: 21; cvc-complex-type.2.4.c: The matching wildcard is strict, but no declaration can be found for element 'faces:resources'.
	at org.springframework.beans.factory.xml.XmlBeanDefinitionReader.doLoadBeanDefinitions(XmlBeanDefinitionReader.java:399)
	at org.springframework.beans.factory.xml.XmlBeanDefinitionReader.loadBeanDefinitions(XmlBeanDefinitionReader.java:336)
	at org.springframework.beans.factory.xml.XmlBeanDefinitionReader.loadBeanDefinitions(XmlBeanDefinitionReader.java:304)
	at org.springframework.beans.factory.support.AbstractBeanDefinitionReader.loadBeanDefinitions(AbstractBeanDefinitionReader.java:181)
	at org.springframework.beans.factory.support.AbstractBeanDefinitionReader.loadBeanDefinitions(AbstractBeanDefinitionReader.java:217)
	at org.springframework.beans.factory.support.AbstractBeanDefinitionReader.loadBeanDefinitions(AbstractBeanDefinitionReader.java:188)
(72 more lines...)
Collapse Failed SelectionTrackingActionListenerTests testProcessActionWithUIData History
Default Job < 1 sec
java.lang.AssertionError: java.lang.AssertionError
java.lang.AssertionError
	at javax.faces.CurrentThreadToServletContext$FactoryManagerCacheKey.initFromFactoryMap(CurrentThreadToServletContext.java:278)
	at javax.faces.CurrentThreadToServletContext$FactoryManagerCacheKey.<init>(CurrentThreadToServletContext.java:256)
	at javax.faces.CurrentThreadToServletContext.getApplicationFactoryManager(CurrentThreadToServletContext.java:104)
	at javax.faces.CurrentThreadToServletContext.getApplicationFactoryManager(CurrentThreadToServletContext.java:97)
	at javax.faces.FactoryFinder.getFactory(FactoryFinder.java:277)
	at javax.faces.context.FacesContext.getCurrentInstance(FacesContext.java:912)
(40 more lines...)
Collapse Failed SelectionTrackingActionListenerTests testProcessActionWithUIRepeat History
Default Job < 1 sec
java.lang.AssertionError: java.lang.AssertionError
java.lang.AssertionError
	at javax.faces.CurrentThreadToServletContext$FactoryManagerCacheKey.initFromFactoryMap(CurrentThreadToServletContext.java:278)
	at javax.faces.CurrentThreadToServletContext$FactoryManagerCacheKey.<init>(CurrentThreadToServletContext.java:256)
	at javax.faces.CurrentThreadToServletContext.getApplicationFactoryManager(CurrentThreadToServletContext.java:104)
	at javax.faces.CurrentThreadToServletContext.getApplicationFactoryManager(CurrentThreadToServletContext.java:97)
	at javax.faces.FactoryFinder.getFactory(FactoryFinder.java:277)
	at javax.faces.context.FacesContext.getCurrentInstance(FacesContext.java:912)
(40 more lines...)
Collapse Failed JsfViewTests testViewResolution History
Default Job < 1 sec
java.lang.AssertionError: java.lang.AssertionError
java.lang.AssertionError
	at javax.faces.CurrentThreadToServletContext$FactoryManagerCacheKey.initFromFactoryMap(CurrentThreadToServletContext.java:278)
	at javax.faces.CurrentThreadToServletContext$FactoryManagerCacheKey.<init>(CurrentThreadToServletContext.java:256)
	at javax.faces.CurrentThreadToServletContext.getApplicationFactoryManager(CurrentThreadToServletContext.java:104)
	at javax.faces.CurrentThreadToServletContext.getApplicationFactoryManager(CurrentThreadToServletContext.java:97)
	at javax.faces.FactoryFinder.getFactory(FactoryFinder.java:277)
	at javax.faces.context.FacesContext.getCurrentInstance(FacesContext.java:912)
(40 more lines...)
Collapse Failed JsfViewTests testViewRender History
Default Job < 1 sec
java.lang.AssertionError: java.lang.AssertionError
java.lang.AssertionError
	at javax.faces.CurrentThreadToServletContext$FactoryManagerCacheKey.initFromFactoryMap(CurrentThreadToServletContext.java:278)
	at javax.faces.CurrentThreadToServletContext$FactoryManagerCacheKey.<init>(CurrentThreadToServletContext.java:256)
	at javax.faces.CurrentThreadToServletContext.getApplicationFactoryManager(CurrentThreadToServletContext.java:104)
	at javax.faces.CurrentThreadToServletContext.getApplicationFactoryManager(CurrentThreadToServletContext.java:97)
	at javax.faces.FactoryFinder.getFactory(FactoryFinder.java:277)
	at javax.faces.context.FacesContext.getCurrentInstance(FacesContext.java:912)
(40 more lines...)
Collapse Failed FlowActionListenerTests testProcessAction_NullOutcome History
Default Job < 1 sec
java.lang.AssertionError: java.lang.AssertionError
java.lang.AssertionError
	at javax.faces.CurrentThreadToServletContext$FactoryManagerCacheKey.initFromFactoryMap(CurrentThreadToServletContext.java:278)
	at javax.faces.CurrentThreadToServletContext$FactoryManagerCacheKey.<init>(CurrentThreadToServletContext.java:256)
	at javax.faces.CurrentThreadToServletContext.getApplicationFactoryManager(CurrentThreadToServletContext.java:104)
	at javax.faces.CurrentThreadToServletContext.getApplicationFactoryManager(CurrentThreadToServletContext.java:97)
	at javax.faces.FactoryFinder.getFactory(FactoryFinder.java:277)
	at javax.faces.context.FacesContext.getCurrentInstance(FacesContext.java:912)
(40 more lines...)
Collapse Failed FlowActionListenerTests testProcessAction History
Default Job < 1 sec
java.lang.AssertionError: java.lang.AssertionError
java.lang.AssertionError
	at javax.faces.CurrentThreadToServletContext$FactoryManagerCacheKey.initFromFactoryMap(CurrentThreadToServletContext.java:278)
	at javax.faces.CurrentThreadToServletContext$FactoryManagerCacheKey.<init>(CurrentThreadToServletContext.java:256)
	at javax.faces.CurrentThreadToServletContext.getApplicationFactoryManager(CurrentThreadToServletContext.java:104)
	at javax.faces.CurrentThreadToServletContext.getApplicationFactoryManager(CurrentThreadToServletContext.java:97)
	at javax.faces.FactoryFinder.getFactory(FactoryFinder.java:277)
	at javax.faces.context.FacesContext.getCurrentInstance(FacesContext.java:912)
(40 more lines...)
Collapse Failed FlowFacesContextTests testValidationFailed History
Default Job < 1 sec
java.lang.AssertionError: java.lang.AssertionError
java.lang.AssertionError
	at javax.faces.CurrentThreadToServletContext$FactoryManagerCacheKey.initFromFactoryMap(CurrentThreadToServletContext.java:278)
	at javax.faces.CurrentThreadToServletContext$FactoryManagerCacheKey.<init>(CurrentThreadToServletContext.java:256)
	at javax.faces.CurrentThreadToServletContext.getApplicationFactoryManager(CurrentThreadToServletContext.java:104)
	at javax.faces.CurrentThreadToServletContext.getApplicationFactoryManager(CurrentThreadToServletContext.java:97)
	at javax.faces.FactoryFinder.getFactory(FactoryFinder.java:277)
	at javax.faces.context.FacesContext.getCurrentInstance(FacesContext.java:912)
(40 more lines...)
Collapse Failed FlowFacesContextTests testAddMessages_MultipleNullIds History
Default Job < 1 sec
java.lang.AssertionError: java.lang.AssertionError
java.lang.AssertionError
	at javax.faces.CurrentThreadToServletContext$FactoryManagerCacheKey.initFromFactoryMap(CurrentThreadToServletContext.java:278)
	at javax.faces.CurrentThreadToServletContext$FactoryManagerCacheKey.<init>(CurrentThreadToServletContext.java:256)
	at javax.faces.CurrentThreadToServletContext.getApplicationFactoryManager(CurrentThreadToServletContext.java:104)
	at javax.faces.CurrentThreadToServletContext.getApplicationFactoryManager(CurrentThreadToServletContext.java:97)
	at javax.faces.FactoryFinder.getFactory(FactoryFinder.java:277)
	at javax.faces.context.FacesContext.getCurrentInstance(FacesContext.java:912)
(40 more lines...)
Collapse Failed FlowFacesContextTests testMessagesAreSerializable History
Default Job < 1 sec
java.lang.AssertionError: java.lang.AssertionError
java.lang.AssertionError
	at javax.faces.CurrentThreadToServletContext$FactoryManagerCacheKey.initFromFactoryMap(CurrentThreadToServletContext.java:278)
	at javax.faces.CurrentThreadToServletContext$FactoryManagerCacheKey.<init>(CurrentThreadToServletContext.java:256)
	at javax.faces.CurrentThreadToServletContext.getApplicationFactoryManager(CurrentThreadToServletContext.java:104)
	at javax.faces.CurrentThreadToServletContext.getApplicationFactoryManager(CurrentThreadToServletContext.java:97)
	at javax.faces.FactoryFinder.getFactory(FactoryFinder.java:277)
	at javax.faces.context.FacesContext.getCurrentInstance(FacesContext.java:912)
(40 more lines...)
Collapse Failed FlowFacesContextTests testGetMessages History
Default Job < 1 sec
java.lang.AssertionError: java.lang.AssertionError
java.lang.AssertionError
	at javax.faces.CurrentThreadToServletContext$FactoryManagerCacheKey.initFromFactoryMap(CurrentThreadToServletContext.java:278)
	at javax.faces.CurrentThreadToServletContext$FactoryManagerCacheKey.<init>(CurrentThreadToServletContext.java:256)
	at javax.faces.CurrentThreadToServletContext.getApplicationFactoryManager(CurrentThreadToServletContext.java:104)
	at javax.faces.CurrentThreadToServletContext.getApplicationFactoryManager(CurrentThreadToServletContext.java:97)
	at javax.faces.FactoryFinder.getFactory(FactoryFinder.java:277)
	at javax.faces.context.FacesContext.getCurrentInstance(FacesContext.java:912)
(40 more lines...)
Collapse Failed FlowFacesContextTests testGetELContext History
Default Job < 1 sec
java.lang.AssertionError: java.lang.AssertionError
java.lang.AssertionError
	at javax.faces.CurrentThreadToServletContext$FactoryManagerCacheKey.initFromFactoryMap(CurrentThreadToServletContext.java:278)
	at javax.faces.CurrentThreadToServletContext$FactoryManagerCacheKey.<init>(CurrentThreadToServletContext.java:256)
	at javax.faces.CurrentThreadToServletContext.getApplicationFactoryManager(CurrentThreadToServletContext.java:104)
	at javax.faces.CurrentThreadToServletContext.getApplicationFactoryManager(CurrentThreadToServletContext.java:97)
	at javax.faces.FactoryFinder.getFactory(FactoryFinder.java:277)
	at javax.faces.context.FacesContext.getCurrentInstance(FacesContext.java:912)
(40 more lines...)
Collapse Failed FlowFacesContextTests testMutableGetMessages History
Default Job < 1 sec
java.lang.AssertionError: java.lang.AssertionError
java.lang.AssertionError
	at javax.faces.CurrentThreadToServletContext$FactoryManagerCacheKey.initFromFactoryMap(CurrentThreadToServletContext.java:278)
	at javax.faces.CurrentThreadToServletContext$FactoryManagerCacheKey.<init>(CurrentThreadToServletContext.java:256)
	at javax.faces.CurrentThreadToServletContext.getApplicationFactoryManager(CurrentThreadToServletContext.java:104)
	at javax.faces.CurrentThreadToServletContext.getApplicationFactoryManager(CurrentThreadToServletContext.java:97)
	at javax.faces.FactoryFinder.getFactory(FactoryFinder.java:277)
	at javax.faces.context.FacesContext.getCurrentInstance(FacesContext.java:912)
(40 more lines...)
Collapse Failed FlowFacesContextTests testGetMaximumSeverity History
Default Job < 1 sec
java.lang.AssertionError: java.lang.AssertionError
java.lang.AssertionError
	at javax.faces.CurrentThreadToServletContext$FactoryManagerCacheKey.initFromFactoryMap(CurrentThreadToServletContext.java:278)
	at javax.faces.CurrentThreadToServletContext$FactoryManagerCacheKey.<init>(CurrentThreadToServletContext.java:256)
	at javax.faces.CurrentThreadToServletContext.getApplicationFactoryManager(CurrentThreadToServletContext.java:104)
	at javax.faces.CurrentThreadToServletContext.getApplicationFactoryManager(CurrentThreadToServletContext.java:97)
	at javax.faces.FactoryFinder.getFactory(FactoryFinder.java:277)
	at javax.faces.context.FacesContext.getCurrentInstance(FacesContext.java:912)
(40 more lines...)
Collapse Failed FlowFacesContextTests testGetClientIdsWithMessages History
Default Job < 1 sec
java.lang.AssertionError: java.lang.AssertionError
java.lang.AssertionError
	at javax.faces.CurrentThreadToServletContext$FactoryManagerCacheKey.initFromFactoryMap(CurrentThreadToServletContext.java:278)
	at javax.faces.CurrentThreadToServletContext$FactoryManagerCacheKey.<init>(CurrentThreadToServletContext.java:256)
	at javax.faces.CurrentThreadToServletContext.getApplicationFactoryManager(CurrentThreadToServletContext.java:104)
	at javax.faces.CurrentThreadToServletContext.getApplicationFactoryManager(CurrentThreadToServletContext.java:97)
	at javax.faces.FactoryFinder.getFactory(FactoryFinder.java:277)
	at javax.faces.context.FacesContext.getCurrentInstance(FacesContext.java:912)
(40 more lines...)
Collapse Failed FlowFacesContextTests testAddMessage History
Default Job < 1 sec
java.lang.AssertionError: java.lang.AssertionError
java.lang.AssertionError
	at javax.faces.CurrentThreadToServletContext$FactoryManagerCacheKey.initFromFactoryMap(CurrentThreadToServletContext.java:278)
	at javax.faces.CurrentThreadToServletContext$FactoryManagerCacheKey.<init>(CurrentThreadToServletContext.java:256)
	at javax.faces.CurrentThreadToServletContext.getApplicationFactoryManager(CurrentThreadToServletContext.java:104)
	at javax.faces.CurrentThreadToServletContext.getApplicationFactoryManager(CurrentThreadToServletContext.java:97)
	at javax.faces.FactoryFinder.getFactory(FactoryFinder.java:277)
	at javax.faces.context.FacesContext.getCurrentInstance(FacesContext.java:912)
(40 more lines...)
Collapse Failed FlowFacesContextTests testGetMessagesByClientId_ForUserMessage History
Default Job < 1 sec
java.lang.AssertionError: java.lang.AssertionError
java.lang.AssertionError
	at javax.faces.CurrentThreadToServletContext$FactoryManagerCacheKey.initFromFactoryMap(CurrentThreadToServletContext.java:278)
	at javax.faces.CurrentThreadToServletContext$FactoryManagerCacheKey.<init>(CurrentThreadToServletContext.java:256)
	at javax.faces.CurrentThreadToServletContext.getApplicationFactoryManager(CurrentThreadToServletContext.java:104)
	at javax.faces.CurrentThreadToServletContext.getApplicationFactoryManager(CurrentThreadToServletContext.java:97)
	at javax.faces.FactoryFinder.getFactory(FactoryFinder.java:277)
	at javax.faces.context.FacesContext.getCurrentInstance(FacesContext.java:912)
(40 more lines...)
Collapse Failed FlowFacesContextTests testCurrentInstance History
Default Job < 1 sec
java.lang.AssertionError: java.lang.AssertionError
java.lang.AssertionError
	at javax.faces.CurrentThreadToServletContext$FactoryManagerCacheKey.initFromFactoryMap(CurrentThreadToServletContext.java:278)
	at javax.faces.CurrentThreadToServletContext$FactoryManagerCacheKey.<init>(CurrentThreadToServletContext.java:256)
	at javax.faces.CurrentThreadToServletContext.getApplicationFactoryManager(CurrentThreadToServletContext.java:104)
	at javax.faces.CurrentThreadToServletContext.getApplicationFactoryManager(CurrentThreadToServletContext.java:97)
	at javax.faces.FactoryFinder.getFactory(FactoryFinder.java:277)
	at javax.faces.context.FacesContext.getCurrentInstance(FacesContext.java:912)
(40 more lines...)
Collapse Failed FlowFacesContextTests testGetAllMessages History
Default Job < 1 sec
java.lang.AssertionError: java.lang.AssertionError
java.lang.AssertionError
	at javax.faces.CurrentThreadToServletContext$FactoryManagerCacheKey.initFromFactoryMap(CurrentThreadToServletContext.java:278)
	at javax.faces.CurrentThreadToServletContext$FactoryManagerCacheKey.<init>(CurrentThreadToServletContext.java:256)
	at javax.faces.CurrentThreadToServletContext.getApplicationFactoryManager(CurrentThreadToServletContext.java:104)
	at javax.faces.CurrentThreadToServletContext.getApplicationFactoryManager(CurrentThreadToServletContext.java:97)
	at javax.faces.FactoryFinder.getFactory(FactoryFinder.java:277)
	at javax.faces.context.FacesContext.getCurrentInstance(FacesContext.java:912)
(40 more lines...)
Collapse Failed FlowFacesContextTests testgetMessagesByClientId_InvalidId History
Default Job < 1 sec
java.lang.AssertionError: java.lang.AssertionError
java.lang.AssertionError
	at javax.faces.CurrentThreadToServletContext$FactoryManagerCacheKey.initFromFactoryMap(CurrentThreadToServletContext.java:278)
	at javax.faces.CurrentThreadToServletContext$FactoryManagerCacheKey.<init>(CurrentThreadToServletContext.java:256)
	at javax.faces.CurrentThreadToServletContext.getApplicationFactoryManager(CurrentThreadToServletContext.java:104)
	at javax.faces.CurrentThreadToServletContext.getApplicationFactoryManager(CurrentThreadToServletContext.java:97)
	at javax.faces.FactoryFinder.getFactory(FactoryFinder.java:277)
	at javax.faces.context.FacesContext.getCurrentInstance(FacesContext.java:912)
(40 more lines...)
Collapse Failed FlowFacesContextTests testGetMessagesByClientId_ForComponent History
Default Job < 1 sec
java.lang.AssertionError: java.lang.AssertionError
java.lang.AssertionError
	at javax.faces.CurrentThreadToServletContext$FactoryManagerCacheKey.initFromFactoryMap(CurrentThreadToServletContext.java:278)
	at javax.faces.CurrentThreadToServletContext$FactoryManagerCacheKey.<init>(CurrentThreadToServletContext.java:256)
	at javax.faces.CurrentThreadToServletContext.getApplicationFactoryManager(CurrentThreadToServletContext.java:104)
	at javax.faces.CurrentThreadToServletContext.getApplicationFactoryManager(CurrentThreadToServletContext.java:97)
	at javax.faces.FactoryFinder.getFactory(FactoryFinder.java:277)
	at javax.faces.context.FacesContext.getCurrentInstance(FacesContext.java:912)
(40 more lines...)
Collapse Failed FlowFacesContextTests testGetGlobalMessagesOnly History
Default Job < 1 sec
java.lang.AssertionError: java.lang.AssertionError
java.lang.AssertionError
	at javax.faces.CurrentThreadToServletContext$FactoryManagerCacheKey.initFromFactoryMap(CurrentThreadToServletContext.java:278)
	at javax.faces.CurrentThreadToServletContext$FactoryManagerCacheKey.<init>(CurrentThreadToServletContext.java:256)
	at javax.faces.CurrentThreadToServletContext.getApplicationFactoryManager(CurrentThreadToServletContext.java:104)
	at javax.faces.CurrentThreadToServletContext.getApplicationFactoryManager(CurrentThreadToServletContext.java:97)
	at javax.faces.FactoryFinder.getFactory(FactoryFinder.java:277)
	at javax.faces.context.FacesContext.getCurrentInstance(FacesContext.java:912)
(40 more lines...)
Collapse Failed FlowResponseStateManagerTests testname History
Default Job < 1 sec
java.lang.AssertionError: java.lang.AssertionError
java.lang.AssertionError
	at javax.faces.CurrentThreadToServletContext$FactoryManagerCacheKey.initFromFactoryMap(CurrentThreadToServletContext.java:278)
	at javax.faces.CurrentThreadToServletContext$FactoryManagerCacheKey.<init>(CurrentThreadToServletContext.java:256)
	at javax.faces.CurrentThreadToServletContext.getApplicationFactoryManager(CurrentThreadToServletContext.java:104)
	at javax.faces.CurrentThreadToServletContext.getApplicationFactoryManager(CurrentThreadToServletContext.java:97)
	at javax.faces.FactoryFinder.getFactory(FactoryFinder.java:277)
	at javax.faces.context.FacesContext.getCurrentInstance(FacesContext.java:912)
(40 more lines...)
Collapse Failed FlowResponseStateManagerTests testGetState History
Default Job < 1 sec
java.lang.AssertionError: java.lang.AssertionError
java.lang.AssertionError
	at javax.faces.CurrentThreadToServletContext$FactoryManagerCacheKey.initFromFactoryMap(CurrentThreadToServletContext.java:278)
	at javax.faces.CurrentThreadToServletContext$FactoryManagerCacheKey.<init>(CurrentThreadToServletContext.java:256)
	at javax.faces.CurrentThreadToServletContext.getApplicationFactoryManager(CurrentThreadToServletContext.java:104)
	at javax.faces.CurrentThreadToServletContext.getApplicationFactoryManager(CurrentThreadToServletContext.java:97)
	at javax.faces.FactoryFinder.getFactory(FactoryFinder.java:277)
	at javax.faces.context.FacesContext.getCurrentInstance(FacesContext.java:912)
(40 more lines...)
Collapse Failed FlowResponseStateManagerTests testWriteFlowSerializedView History
Default Job < 1 sec
java.lang.AssertionError: java.lang.AssertionError
java.lang.AssertionError
	at javax.faces.CurrentThreadToServletContext$FactoryManagerCacheKey.initFromFactoryMap(CurrentThreadToServletContext.java:278)
	at javax.faces.CurrentThreadToServletContext$FactoryManagerCacheKey.<init>(CurrentThreadToServletContext.java:256)
	at javax.faces.CurrentThreadToServletContext.getApplicationFactoryManager(CurrentThreadToServletContext.java:104)
	at javax.faces.CurrentThreadToServletContext.getApplicationFactoryManager(CurrentThreadToServletContext.java:97)
	at javax.faces.FactoryFinder.getFactory(FactoryFinder.java:277)
	at javax.faces.context.FacesContext.getCurrentInstance(FacesContext.java:912)
(40 more lines...)
Collapse Failed JsfAjaxHandlerTests testSendAjaxRedirect History
Default Job < 1 sec
java.lang.AssertionError: java.lang.AssertionError
java.lang.AssertionError
	at javax.faces.CurrentThreadToServletContext$FactoryManagerCacheKey.initFromFactoryMap(CurrentThreadToServletContext.java:278)
	at javax.faces.CurrentThreadToServletContext$FactoryManagerCacheKey.<init>(CurrentThreadToServletContext.java:256)
	at javax.faces.CurrentThreadToServletContext.getApplicationFactoryManager(CurrentThreadToServletContext.java:104)
	at javax.faces.CurrentThreadToServletContext.getApplicationFactoryManager(CurrentThreadToServletContext.java:97)
	at javax.faces.FactoryFinder.getFactory(FactoryFinder.java:277)
	at javax.faces.context.FacesContext.getCurrentInstance(FacesContext.java:912)
(38 more lines...)
Collapse Failed JsfFinalResponseActionTests testRender History
Default Job < 1 sec
java.lang.AssertionError: java.lang.AssertionError
java.lang.AssertionError
	at javax.faces.CurrentThreadToServletContext$FactoryManagerCacheKey.initFromFactoryMap(CurrentThreadToServletContext.java:278)
	at javax.faces.CurrentThreadToServletContext$FactoryManagerCacheKey.<init>(CurrentThreadToServletContext.java:256)
	at javax.faces.CurrentThreadToServletContext.getApplicationFactoryManager(CurrentThreadToServletContext.java:104)
	at javax.faces.CurrentThreadToServletContext.getApplicationFactoryManager(CurrentThreadToServletContext.java:97)
	at javax.faces.FactoryFinder.getFactory(FactoryFinder.java:277)
	at javax.faces.context.FacesContext.getCurrentInstance(FacesContext.java:912)
(39 more lines...)
Collapse Failed JsfManagedBeanAwareELExpressionParserTests testGetJSFBean History
Default Job < 1 sec
java.lang.AssertionError: java.lang.AssertionError
java.lang.AssertionError
	at javax.faces.CurrentThreadToServletContext$FactoryManagerCacheKey.initFromFactoryMap(CurrentThreadToServletContext.java:278)
	at javax.faces.CurrentThreadToServletContext$FactoryManagerCacheKey.<init>(CurrentThreadToServletContext.java:256)
	at javax.faces.CurrentThreadToServletContext.getApplicationFactoryManager(CurrentThreadToServletContext.java:104)
	at javax.faces.CurrentThreadToServletContext.getApplicationFactoryManager(CurrentThreadToServletContext.java:97)
	at javax.faces.FactoryFinder.getFactory(FactoryFinder.java:277)
	at javax.faces.context.FacesContext.getCurrentInstance(FacesContext.java:912)
(40 more lines...)
Collapse Failed JsfManagedBeanPropertyAccessorTests testCanRead History
Default Job < 1 sec
java.lang.AssertionError: java.lang.AssertionError
java.lang.AssertionError
	at javax.faces.CurrentThreadToServletContext$FactoryManagerCacheKey.initFromFactoryMap(CurrentThreadToServletContext.java:278)
	at javax.faces.CurrentThreadToServletContext$FactoryManagerCacheKey.<init>(CurrentThreadToServletContext.java:256)
	at javax.faces.CurrentThreadToServletContext.getApplicationFactoryManager(CurrentThreadToServletContext.java:104)
	at javax.faces.CurrentThreadToServletContext.getApplicationFactoryManager(CurrentThreadToServletContext.java:97)
	at javax.faces.FactoryFinder.getFactory(FactoryFinder.java:277)
	at javax.faces.context.FacesContext.getCurrentInstance(FacesContext.java:912)
(38 more lines...)
Collapse Failed JsfManagedBeanPropertyAccessorTests testCanWrite History
Default Job < 1 sec
java.lang.AssertionError: java.lang.AssertionError
java.lang.AssertionError
	at javax.faces.CurrentThreadToServletContext$FactoryManagerCacheKey.initFromFactoryMap(CurrentThreadToServletContext.java:278)
	at javax.faces.CurrentThreadToServletContext$FactoryManagerCacheKey.<init>(CurrentThreadToServletContext.java:256)
	at javax.faces.CurrentThreadToServletContext.getApplicationFactoryManager(CurrentThreadToServletContext.java:104)
	at javax.faces.CurrentThreadToServletContext.getApplicationFactoryManager(CurrentThreadToServletContext.java:97)
	at javax.faces.FactoryFinder.getFactory(FactoryFinder.java:277)
	at javax.faces.context.FacesContext.getCurrentInstance(FacesContext.java:912)
(38 more lines...)
Collapse Failed JsfManagedBeanPropertyAccessorTests testRead History
Default Job < 1 sec
java.lang.AssertionError: java.lang.AssertionError
java.lang.AssertionError
	at javax.faces.CurrentThreadToServletContext$FactoryManagerCacheKey.initFromFactoryMap(CurrentThreadToServletContext.java:278)
	at javax.faces.CurrentThreadToServletContext$FactoryManagerCacheKey.<init>(CurrentThreadToServletContext.java:256)
	at javax.faces.CurrentThreadToServletContext.getApplicationFactoryManager(CurrentThreadToServletContext.java:104)
	at javax.faces.CurrentThreadToServletContext.getApplicationFactoryManager(CurrentThreadToServletContext.java:97)
	at javax.faces.FactoryFinder.getFactory(FactoryFinder.java:277)
	at javax.faces.context.FacesContext.getCurrentInstance(FacesContext.java:912)
(38 more lines...)
Collapse Failed JsfManagedBeanPropertyAccessorTests testWrite History
Default Job < 1 sec
java.lang.AssertionError: java.lang.AssertionError
java.lang.AssertionError
	at javax.faces.CurrentThreadToServletContext$FactoryManagerCacheKey.initFromFactoryMap(CurrentThreadToServletContext.java:278)
	at javax.faces.CurrentThreadToServletContext$FactoryManagerCacheKey.<init>(CurrentThreadToServletContext.java:256)
	at javax.faces.CurrentThreadToServletContext.getApplicationFactoryManager(CurrentThreadToServletContext.java:104)
	at javax.faces.CurrentThreadToServletContext.getApplicationFactoryManager(CurrentThreadToServletContext.java:97)
	at javax.faces.FactoryFinder.getFactory(FactoryFinder.java:277)
	at javax.faces.context.FacesContext.getCurrentInstance(FacesContext.java:912)
(38 more lines...)
Collapse Failed JsfUtilsTests testBeforeListenersCalledInForwardOrder History
Default Job < 1 sec
java.lang.AssertionError: java.lang.AssertionError
java.lang.AssertionError
	at javax.faces.CurrentThreadToServletContext$FactoryManagerCacheKey.initFromFactoryMap(CurrentThreadToServletContext.java:278)
	at javax.faces.CurrentThreadToServletContext$FactoryManagerCacheKey.<init>(CurrentThreadToServletContext.java:256)
	at javax.faces.CurrentThreadToServletContext.getApplicationFactoryManager(CurrentThreadToServletContext.java:104)
	at javax.faces.CurrentThreadToServletContext.getApplicationFactoryManager(CurrentThreadToServletContext.java:91)
	at javax.faces.FactoryFinder.releaseFactories(FactoryFinder.java:332)
	at org.apache.myfaces.test.base.AbstractJsfTestCase.setUp(AbstractJsfTestCase.java:106)
(35 more lines...)
Collapse Failed JsfUtilsTests testAfterListenersCalledInReverseOrder History
Default Job < 1 sec
java.lang.AssertionError: java.lang.AssertionError
java.lang.AssertionError
	at javax.faces.CurrentThreadToServletContext$FactoryManagerCacheKey.initFromFactoryMap(CurrentThreadToServletContext.java:278)
	at javax.faces.CurrentThreadToServletContext$FactoryManagerCacheKey.<init>(CurrentThreadToServletContext.java:256)
	at javax.faces.CurrentThreadToServletContext.getApplicationFactoryManager(CurrentThreadToServletContext.java:104)
	at javax.faces.CurrentThreadToServletContext.getApplicationFactoryManager(CurrentThreadToServletContext.java:91)
	at javax.faces.FactoryFinder.releaseFactories(FactoryFinder.java:332)
	at org.apache.myfaces.test.base.AbstractJsfTestCase.setUp(AbstractJsfTestCase.java:106)
(35 more lines...)
Collapse Failed JsfUtilsTests testGetUnknowFactory History
Default Job < 1 sec
java.lang.AssertionError: java.lang.AssertionError
java.lang.AssertionError
	at javax.faces.CurrentThreadToServletContext$FactoryManagerCacheKey.initFromFactoryMap(CurrentThreadToServletContext.java:278)
	at javax.faces.CurrentThreadToServletContext$FactoryManagerCacheKey.<init>(CurrentThreadToServletContext.java:256)
	at javax.faces.CurrentThreadToServletContext.getApplicationFactoryManager(CurrentThreadToServletContext.java:104)
	at javax.faces.CurrentThreadToServletContext.getApplicationFactoryManager(CurrentThreadToServletContext.java:91)
	at javax.faces.FactoryFinder.releaseFactories(FactoryFinder.java:332)
	at org.apache.myfaces.test.base.AbstractJsfTestCase.setUp(AbstractJsfTestCase.java:106)
(35 more lines...)
Collapse Failed JsfUtilsTests testGetFactory History
Default Job < 1 sec
java.lang.AssertionError: java.lang.AssertionError
java.lang.AssertionError
	at javax.faces.CurrentThreadToServletContext$FactoryManagerCacheKey.initFromFactoryMap(CurrentThreadToServletContext.java:278)
	at javax.faces.CurrentThreadToServletContext$FactoryManagerCacheKey.<init>(CurrentThreadToServletContext.java:256)
	at javax.faces.CurrentThreadToServletContext.getApplicationFactoryManager(CurrentThreadToServletContext.java:104)
	at javax.faces.CurrentThreadToServletContext.getApplicationFactoryManager(CurrentThreadToServletContext.java:91)
	at javax.faces.FactoryFinder.releaseFactories(FactoryFinder.java:332)
	at org.apache.myfaces.test.base.AbstractJsfTestCase.setUp(AbstractJsfTestCase.java:106)
(35 more lines...)
Collapse Failed JsfViewFactoryTests testGetView_ExceptionsOnPostRestoreStateEvent History
Default Job < 1 sec
java.lang.AssertionError: java.lang.AssertionError
java.lang.AssertionError
	at javax.faces.CurrentThreadToServletContext$FactoryManagerCacheKey.initFromFactoryMap(CurrentThreadToServletContext.java:278)
	at javax.faces.CurrentThreadToServletContext$FactoryManagerCacheKey.<init>(CurrentThreadToServletContext.java:256)
	at javax.faces.CurrentThreadToServletContext.getApplicationFactoryManager(CurrentThreadToServletContext.java:104)
	at javax.faces.CurrentThreadToServletContext.getApplicationFactoryManager(CurrentThreadToServletContext.java:97)
	at javax.faces.FactoryFinder.getFactory(FactoryFinder.java:277)
	at javax.faces.context.FacesContext.getCurrentInstance(FacesContext.java:912)
(39 more lines...)
Collapse Failed JsfViewFactoryTests testGetView_Restore History
Default Job < 1 sec
java.lang.AssertionError: java.lang.AssertionError
java.lang.AssertionError
	at javax.faces.CurrentThreadToServletContext$FactoryManagerCacheKey.initFromFactoryMap(CurrentThreadToServletContext.java:278)
	at javax.faces.CurrentThreadToServletContext$FactoryManagerCacheKey.<init>(CurrentThreadToServletContext.java:256)
	at javax.faces.CurrentThreadToServletContext.getApplicationFactoryManager(CurrentThreadToServletContext.java:104)
	at javax.faces.CurrentThreadToServletContext.getApplicationFactoryManager(CurrentThreadToServletContext.java:97)
	at javax.faces.FactoryFinder.getFactory(FactoryFinder.java:277)
	at javax.faces.context.FacesContext.getCurrentInstance(FacesContext.java:912)
(39 more lines...)
Collapse Failed JsfViewFactoryTests testGetView_ExternalViewRoot History
Default Job < 1 sec
java.lang.AssertionError: java.lang.AssertionError
java.lang.AssertionError
	at javax.faces.CurrentThreadToServletContext$FactoryManagerCacheKey.initFromFactoryMap(CurrentThreadToServletContext.java:278)
	at javax.faces.CurrentThreadToServletContext$FactoryManagerCacheKey.<init>(CurrentThreadToServletContext.java:256)
	at javax.faces.CurrentThreadToServletContext.getApplicationFactoryManager(CurrentThreadToServletContext.java:104)
	at javax.faces.CurrentThreadToServletContext.getApplicationFactoryManager(CurrentThreadToServletContext.java:97)
	at javax.faces.FactoryFinder.getFactory(FactoryFinder.java:277)
	at javax.faces.context.FacesContext.getCurrentInstance(FacesContext.java:912)
(39 more lines...)
Collapse Failed JsfViewFactoryTests testGetView_Restore_Ajax History
Default Job < 1 sec
java.lang.AssertionError: java.lang.AssertionError
java.lang.AssertionError
	at javax.faces.CurrentThreadToServletContext$FactoryManagerCacheKey.initFromFactoryMap(CurrentThreadToServletContext.java:278)
	at javax.faces.CurrentThreadToServletContext$FactoryManagerCacheKey.<init>(CurrentThreadToServletContext.java:256)
	at javax.faces.CurrentThreadToServletContext.getApplicationFactoryManager(CurrentThreadToServletContext.java:104)
	at javax.faces.CurrentThreadToServletContext.getApplicationFactoryManager(CurrentThreadToServletContext.java:97)
	at javax.faces.FactoryFinder.getFactory(FactoryFinder.java:277)
	at javax.faces.context.FacesContext.getCurrentInstance(FacesContext.java:912)
(39 more lines...)
Collapse Failed JsfViewFactoryTests testGetView_RestoreWithBindings History
Default Job < 1 sec
java.lang.AssertionError: java.lang.AssertionError
java.lang.AssertionError
	at javax.faces.CurrentThreadToServletContext$FactoryManagerCacheKey.initFromFactoryMap(CurrentThreadToServletContext.java:278)
	at javax.faces.CurrentThreadToServletContext$FactoryManagerCacheKey.<init>(CurrentThreadToServletContext.java:256)
	at javax.faces.CurrentThreadToServletContext.getApplicationFactoryManager(CurrentThreadToServletContext.java:104)
	at javax.faces.CurrentThreadToServletContext.getApplicationFactoryManager(CurrentThreadToServletContext.java:97)
	at javax.faces.FactoryFinder.getFactory(FactoryFinder.java:277)
	at javax.faces.context.FacesContext.getCurrentInstance(FacesContext.java:912)
(39 more lines...)