Spring Web Flow 2.4.x

Test results

  • 286 tests in total
  • 61 tests failed
  • 61 failures are new
  • 1 second taken in total.
New test failures 61
Status Test View job Duration
Collapse Failed FacesFlowBuilderServicesBeanDefinitionParserTests testEnableManagedBeans History
Default Job < 1 sec
java.lang.AssertionError: java.lang.AssertionError
java.lang.AssertionError
	at javax.faces.CurrentThreadToServletContext$FactoryManagerCacheKey.initFromFactoryMap(CurrentThreadToServletContext.java:278)
	at javax.faces.CurrentThreadToServletContext$FactoryManagerCacheKey.<init>(CurrentThreadToServletContext.java:256)
	at javax.faces.CurrentThreadToServletContext.getApplicationFactoryManager(CurrentThreadToServletContext.java:104)
	at javax.faces.CurrentThreadToServletContext.getApplicationFactoryManager(CurrentThreadToServletContext.java:97)
	at javax.faces.FactoryFinder.getFactory(FactoryFinder.java:277)
	at javax.faces.context.FacesContext.getCurrentInstance(FacesContext.java:912)
(40 more lines...)
Collapse Failed FacesFlowBuilderServicesBeanDefinitionParserTests testFlowBuilderServicesConversionServiceCustomized History
Default Job < 1 sec
java.lang.AssertionError: java.lang.AssertionError
java.lang.AssertionError
	at javax.faces.CurrentThreadToServletContext$FactoryManagerCacheKey.initFromFactoryMap(CurrentThreadToServletContext.java:278)
	at javax.faces.CurrentThreadToServletContext$FactoryManagerCacheKey.<init>(CurrentThreadToServletContext.java:256)
	at javax.faces.CurrentThreadToServletContext.getApplicationFactoryManager(CurrentThreadToServletContext.java:104)
	at javax.faces.CurrentThreadToServletContext.getApplicationFactoryManager(CurrentThreadToServletContext.java:97)
	at javax.faces.FactoryFinder.getFactory(FactoryFinder.java:277)
	at javax.faces.context.FacesContext.getCurrentInstance(FacesContext.java:912)
(40 more lines...)
Collapse Failed FacesFlowBuilderServicesBeanDefinitionParserTests testConfigureDefaults History
Default Job < 1 sec
java.lang.AssertionError: java.lang.AssertionError
java.lang.AssertionError
	at javax.faces.CurrentThreadToServletContext$FactoryManagerCacheKey.initFromFactoryMap(CurrentThreadToServletContext.java:278)
	at javax.faces.CurrentThreadToServletContext$FactoryManagerCacheKey.<init>(CurrentThreadToServletContext.java:256)
	at javax.faces.CurrentThreadToServletContext.getApplicationFactoryManager(CurrentThreadToServletContext.java:104)
	at javax.faces.CurrentThreadToServletContext.getApplicationFactoryManager(CurrentThreadToServletContext.java:97)
	at javax.faces.FactoryFinder.getFactory(FactoryFinder.java:277)
	at javax.faces.context.FacesContext.getCurrentInstance(FacesContext.java:912)
(40 more lines...)
Collapse Failed FacesFlowBuilderServicesBeanDefinitionParserTests testFlowBuilderServicesAllCustomized History
Default Job < 1 sec
java.lang.AssertionError: java.lang.AssertionError
java.lang.AssertionError
	at javax.faces.CurrentThreadToServletContext$FactoryManagerCacheKey.initFromFactoryMap(CurrentThreadToServletContext.java:278)
	at javax.faces.CurrentThreadToServletContext$FactoryManagerCacheKey.<init>(CurrentThreadToServletContext.java:256)
	at javax.faces.CurrentThreadToServletContext.getApplicationFactoryManager(CurrentThreadToServletContext.java:104)
	at javax.faces.CurrentThreadToServletContext.getApplicationFactoryManager(CurrentThreadToServletContext.java:97)
	at javax.faces.FactoryFinder.getFactory(FactoryFinder.java:277)
	at javax.faces.context.FacesContext.getCurrentInstance(FacesContext.java:912)
(40 more lines...)
Collapse Failed FacesFlowBuilderServicesJavaConfigTests testFlowBuilderServicesConversionServiceCustomized History
Default Job < 1 sec
java.lang.AssertionError: java.lang.AssertionError
java.lang.AssertionError
	at javax.faces.CurrentThreadToServletContext$FactoryManagerCacheKey.initFromFactoryMap(CurrentThreadToServletContext.java:278)
	at javax.faces.CurrentThreadToServletContext$FactoryManagerCacheKey.<init>(CurrentThreadToServletContext.java:256)
	at javax.faces.CurrentThreadToServletContext.getApplicationFactoryManager(CurrentThreadToServletContext.java:104)
	at javax.faces.CurrentThreadToServletContext.getApplicationFactoryManager(CurrentThreadToServletContext.java:97)
	at javax.faces.FactoryFinder.getFactory(FactoryFinder.java:277)
	at javax.faces.context.FacesContext.getCurrentInstance(FacesContext.java:912)
(40 more lines...)
Collapse Failed FacesFlowBuilderServicesJavaConfigTests testConfigureDefaults History
Default Job < 1 sec
java.lang.AssertionError: java.lang.AssertionError
java.lang.AssertionError
	at javax.faces.CurrentThreadToServletContext$FactoryManagerCacheKey.initFromFactoryMap(CurrentThreadToServletContext.java:278)
	at javax.faces.CurrentThreadToServletContext$FactoryManagerCacheKey.<init>(CurrentThreadToServletContext.java:256)
	at javax.faces.CurrentThreadToServletContext.getApplicationFactoryManager(CurrentThreadToServletContext.java:104)
	at javax.faces.CurrentThreadToServletContext.getApplicationFactoryManager(CurrentThreadToServletContext.java:97)
	at javax.faces.FactoryFinder.getFactory(FactoryFinder.java:277)
	at javax.faces.context.FacesContext.getCurrentInstance(FacesContext.java:912)
(40 more lines...)
Collapse Failed FacesFlowBuilderServicesJavaConfigTests testFlowBuilderServicesAllCustomized History
Default Job < 1 sec
java.lang.AssertionError: java.lang.AssertionError
java.lang.AssertionError
	at javax.faces.CurrentThreadToServletContext$FactoryManagerCacheKey.initFromFactoryMap(CurrentThreadToServletContext.java:278)
	at javax.faces.CurrentThreadToServletContext$FactoryManagerCacheKey.<init>(CurrentThreadToServletContext.java:256)
	at javax.faces.CurrentThreadToServletContext.getApplicationFactoryManager(CurrentThreadToServletContext.java:104)
	at javax.faces.CurrentThreadToServletContext.getApplicationFactoryManager(CurrentThreadToServletContext.java:97)
	at javax.faces.FactoryFinder.getFactory(FactoryFinder.java:277)
	at javax.faces.context.FacesContext.getCurrentInstance(FacesContext.java:912)
(40 more lines...)
Collapse Failed FacesFlowBuilderServicesJavaConfigTests testEnableManagedBeans History
Default Job < 1 sec
java.lang.AssertionError: java.lang.AssertionError
java.lang.AssertionError
	at javax.faces.CurrentThreadToServletContext$FactoryManagerCacheKey.initFromFactoryMap(CurrentThreadToServletContext.java:278)
	at javax.faces.CurrentThreadToServletContext$FactoryManagerCacheKey.<init>(CurrentThreadToServletContext.java:256)
	at javax.faces.CurrentThreadToServletContext.getApplicationFactoryManager(CurrentThreadToServletContext.java:104)
	at javax.faces.CurrentThreadToServletContext.getApplicationFactoryManager(CurrentThreadToServletContext.java:97)
	at javax.faces.FactoryFinder.getFactory(FactoryFinder.java:277)
	at javax.faces.context.FacesContext.getCurrentInstance(FacesContext.java:912)
(40 more lines...)
Collapse Failed ResourcesBeanDefinitionParserTests testConfigureDefaults History
Default Job < 1 sec
java.lang.AssertionError: java.lang.AssertionError
java.lang.AssertionError
	at javax.faces.CurrentThreadToServletContext$FactoryManagerCacheKey.initFromFactoryMap(CurrentThreadToServletContext.java:278)
	at javax.faces.CurrentThreadToServletContext$FactoryManagerCacheKey.<init>(CurrentThreadToServletContext.java:256)
	at javax.faces.CurrentThreadToServletContext.getApplicationFactoryManager(CurrentThreadToServletContext.java:104)
	at javax.faces.CurrentThreadToServletContext.getApplicationFactoryManager(CurrentThreadToServletContext.java:91)
	at javax.faces.FactoryFinder.setFactory(FactoryFinder.java:310)
	at org.springframework.faces.webflow.JSFMockHelper$JSFMock.setUp(JSFMockHelper.java:138)
(39 more lines...)
Collapse Failed ResourcesBeanDefinitionParserTests testConfigurePortlet History
Default Job < 1 sec
org.springframework.beans.factory.xml.XmlBeanDefinitionStoreException: org.springframework.beans.factory.xml.XmlBeanDefinitionStoreException: Line 9 in XML document from class path resource [org/springframework/faces/config/resources.xml] is invalid; nested exception is org.xml.sax.SAXParseException; lineNumber: 9; columnNumber: 21; cvc-complex-type.2.4.c: The matching wildcard is strict, but no declaration can be found for element 'faces:resources'.
org.springframework.beans.factory.xml.XmlBeanDefinitionStoreException: Line 9 in XML document from class path resource [org/springframework/faces/config/resources.xml] is invalid; nested exception is org.xml.sax.SAXParseException; lineNumber: 9; columnNumber: 21; cvc-complex-type.2.4.c: The matching wildcard is strict, but no declaration can be found for element 'faces:resources'.
	at org.springframework.beans.factory.xml.XmlBeanDefinitionReader.doLoadBeanDefinitions(XmlBeanDefinitionReader.java:399)
	at org.springframework.beans.factory.xml.XmlBeanDefinitionReader.loadBeanDefinitions(XmlBeanDefinitionReader.java:336)
	at org.springframework.beans.factory.xml.XmlBeanDefinitionReader.loadBeanDefinitions(XmlBeanDefinitionReader.java:304)
	at org.springframework.beans.factory.support.AbstractBeanDefinitionReader.loadBeanDefinitions(AbstractBeanDefinitionReader.java:181)
	at org.springframework.beans.factory.support.AbstractBeanDefinitionReader.loadBeanDefinitions(AbstractBeanDefinitionReader.java:217)
	at org.springframework.beans.factory.support.AbstractBeanDefinitionReader.loadBeanDefinitions(AbstractBeanDefinitionReader.java:188)
(72 more lines...)
Collapse Failed SelectionTrackingActionListenerTests testProcessActionWithUIData History
Default Job < 1 sec
java.lang.AssertionError: java.lang.AssertionError
java.lang.AssertionError
	at javax.faces.CurrentThreadToServletContext$FactoryManagerCacheKey.initFromFactoryMap(CurrentThreadToServletContext.java:278)
	at javax.faces.CurrentThreadToServletContext$FactoryManagerCacheKey.<init>(CurrentThreadToServletContext.java:256)
	at javax.faces.CurrentThreadToServletContext.getApplicationFactoryManager(CurrentThreadToServletContext.java:104)
	at javax.faces.CurrentThreadToServletContext.getApplicationFactoryManager(CurrentThreadToServletContext.java:97)
	at javax.faces.FactoryFinder.getFactory(FactoryFinder.java:277)
	at javax.faces.context.FacesContext.getCurrentInstance(FacesContext.java:912)
(40 more lines...)
Collapse Failed SelectionTrackingActionListenerTests testProcessActionWithUIRepeat History
Default Job < 1 sec
java.lang.AssertionError: java.lang.AssertionError
java.lang.AssertionError
	at javax.faces.CurrentThreadToServletContext$FactoryManagerCacheKey.initFromFactoryMap(CurrentThreadToServletContext.java:278)
	at javax.faces.CurrentThreadToServletContext$FactoryManagerCacheKey.<init>(CurrentThreadToServletContext.java:256)
	at javax.faces.CurrentThreadToServletContext.getApplicationFactoryManager(CurrentThreadToServletContext.java:104)
	at javax.faces.CurrentThreadToServletContext.getApplicationFactoryManager(CurrentThreadToServletContext.java:97)
	at javax.faces.FactoryFinder.getFactory(FactoryFinder.java:277)
	at javax.faces.context.FacesContext.getCurrentInstance(FacesContext.java:912)
(40 more lines...)
Collapse Failed JsfViewTests testViewResolution History
Default Job < 1 sec
java.lang.AssertionError: java.lang.AssertionError
java.lang.AssertionError
	at javax.faces.CurrentThreadToServletContext$FactoryManagerCacheKey.initFromFactoryMap(CurrentThreadToServletContext.java:278)
	at javax.faces.CurrentThreadToServletContext$FactoryManagerCacheKey.<init>(CurrentThreadToServletContext.java:256)
	at javax.faces.CurrentThreadToServletContext.getApplicationFactoryManager(CurrentThreadToServletContext.java:104)
	at javax.faces.CurrentThreadToServletContext.getApplicationFactoryManager(CurrentThreadToServletContext.java:97)
	at javax.faces.FactoryFinder.getFactory(FactoryFinder.java:277)
	at javax.faces.context.FacesContext.getCurrentInstance(FacesContext.java:912)
(40 more lines...)
Collapse Failed JsfViewTests testViewRender History
Default Job < 1 sec
java.lang.AssertionError: java.lang.AssertionError
java.lang.AssertionError
	at javax.faces.CurrentThreadToServletContext$FactoryManagerCacheKey.initFromFactoryMap(CurrentThreadToServletContext.java:278)
	at javax.faces.CurrentThreadToServletContext$FactoryManagerCacheKey.<init>(CurrentThreadToServletContext.java:256)
	at javax.faces.CurrentThreadToServletContext.getApplicationFactoryManager(CurrentThreadToServletContext.java:104)
	at javax.faces.CurrentThreadToServletContext.getApplicationFactoryManager(CurrentThreadToServletContext.java:97)
	at javax.faces.FactoryFinder.getFactory(FactoryFinder.java:277)
	at javax.faces.context.FacesContext.getCurrentInstance(FacesContext.java:912)
(40 more lines...)
Collapse Failed FlowActionListenerTests testProcessAction_NullOutcome History
Default Job < 1 sec
java.lang.AssertionError: java.lang.AssertionError
java.lang.AssertionError
	at javax.faces.CurrentThreadToServletContext$FactoryManagerCacheKey.initFromFactoryMap(CurrentThreadToServletContext.java:278)
	at javax.faces.CurrentThreadToServletContext$FactoryManagerCacheKey.<init>(CurrentThreadToServletContext.java:256)
	at javax.faces.CurrentThreadToServletContext.getApplicationFactoryManager(CurrentThreadToServletContext.java:104)
	at javax.faces.CurrentThreadToServletContext.getApplicationFactoryManager(CurrentThreadToServletContext.java:97)
	at javax.faces.FactoryFinder.getFactory(FactoryFinder.java:277)
	at javax.faces.context.FacesContext.getCurrentInstance(FacesContext.java:912)
(40 more lines...)
Collapse Failed FlowActionListenerTests testProcessAction History
Default Job < 1 sec
java.lang.AssertionError: java.lang.AssertionError
java.lang.AssertionError
	at javax.faces.CurrentThreadToServletContext$FactoryManagerCacheKey.initFromFactoryMap(CurrentThreadToServletContext.java:278)
	at javax.faces.CurrentThreadToServletContext$FactoryManagerCacheKey.<init>(CurrentThreadToServletContext.java:256)
	at javax.faces.CurrentThreadToServletContext.getApplicationFactoryManager(CurrentThreadToServletContext.java:104)
	at javax.faces.CurrentThreadToServletContext.getApplicationFactoryManager(CurrentThreadToServletContext.java:97)
	at javax.faces.FactoryFinder.getFactory(FactoryFinder.java:277)
	at javax.faces.context.FacesContext.getCurrentInstance(FacesContext.java:912)
(40 more lines...)
Collapse Failed FlowFacesContextTests testValidationFailed History
Default Job < 1 sec
java.lang.AssertionError: java.lang.AssertionError
java.lang.AssertionError
	at javax.faces.CurrentThreadToServletContext$FactoryManagerCacheKey.initFromFactoryMap(CurrentThreadToServletContext.java:278)
	at javax.faces.CurrentThreadToServletContext$FactoryManagerCacheKey.<init>(CurrentThreadToServletContext.java:256)
	at javax.faces.CurrentThreadToServletContext.getApplicationFactoryManager(CurrentThreadToServletContext.java:104)
	at javax.faces.CurrentThreadToServletContext.getApplicationFactoryManager(CurrentThreadToServletContext.java:97)
	at javax.faces.FactoryFinder.getFactory(FactoryFinder.java:277)
	at javax.faces.context.FacesContext.getCurrentInstance(FacesContext.java:912)
(40 more lines...)
Collapse Failed FlowFacesContextTests testAddMessages_MultipleNullIds History
Default Job < 1 sec
java.lang.AssertionError: java.lang.AssertionError
java.lang.AssertionError
	at javax.faces.CurrentThreadToServletContext$FactoryManagerCacheKey.initFromFactoryMap(CurrentThreadToServletContext.java:278)
	at javax.faces.CurrentThreadToServletContext$FactoryManagerCacheKey.<init>(CurrentThreadToServletContext.java:256)
	at javax.faces.CurrentThreadToServletContext.getApplicationFactoryManager(CurrentThreadToServletContext.java:104)
	at javax.faces.CurrentThreadToServletContext.getApplicationFactoryManager(CurrentThreadToServletContext.java:97)
	at javax.faces.FactoryFinder.getFactory(FactoryFinder.java:277)
	at javax.faces.context.FacesContext.getCurrentInstance(FacesContext.java:912)
(40 more lines...)
Collapse Failed FlowFacesContextTests testMessagesAreSerializable History
Default Job < 1 sec
java.lang.AssertionError: java.lang.AssertionError
java.lang.AssertionError
	at javax.faces.CurrentThreadToServletContext$FactoryManagerCacheKey.initFromFactoryMap(CurrentThreadToServletContext.java:278)
	at javax.faces.CurrentThreadToServletContext$FactoryManagerCacheKey.<init>(CurrentThreadToServletContext.java:256)
	at javax.faces.CurrentThreadToServletContext.getApplicationFactoryManager(CurrentThreadToServletContext.java:104)
	at javax.faces.CurrentThreadToServletContext.getApplicationFactoryManager(CurrentThreadToServletContext.java:97)
	at javax.faces.FactoryFinder.getFactory(FactoryFinder.java:277)
	at javax.faces.context.FacesContext.getCurrentInstance(FacesContext.java:912)
(40 more lines...)
Collapse Failed FlowFacesContextTests testGetMessages History
Default Job < 1 sec
java.lang.AssertionError: java.lang.AssertionError
java.lang.AssertionError
	at javax.faces.CurrentThreadToServletContext$FactoryManagerCacheKey.initFromFactoryMap(CurrentThreadToServletContext.java:278)
	at javax.faces.CurrentThreadToServletContext$FactoryManagerCacheKey.<init>(CurrentThreadToServletContext.java:256)
	at javax.faces.CurrentThreadToServletContext.getApplicationFactoryManager(CurrentThreadToServletContext.java:104)
	at javax.faces.CurrentThreadToServletContext.getApplicationFactoryManager(CurrentThreadToServletContext.java:97)
	at javax.faces.FactoryFinder.getFactory(FactoryFinder.java:277)
	at javax.faces.context.FacesContext.getCurrentInstance(FacesContext.java:912)
(40 more lines...)
Collapse Failed FlowFacesContextTests testGetELContext History
Default Job < 1 sec
java.lang.AssertionError: java.lang.AssertionError
java.lang.AssertionError
	at javax.faces.CurrentThreadToServletContext$FactoryManagerCacheKey.initFromFactoryMap(CurrentThreadToServletContext.java:278)
	at javax.faces.CurrentThreadToServletContext$FactoryManagerCacheKey.<init>(CurrentThreadToServletContext.java:256)
	at javax.faces.CurrentThreadToServletContext.getApplicationFactoryManager(CurrentThreadToServletContext.java:104)
	at javax.faces.CurrentThreadToServletContext.getApplicationFactoryManager(CurrentThreadToServletContext.java:97)
	at javax.faces.FactoryFinder.getFactory(FactoryFinder.java:277)
	at javax.faces.context.FacesContext.getCurrentInstance(FacesContext.java:912)
(40 more lines...)
Collapse Failed FlowFacesContextTests testMutableGetMessages History
Default Job < 1 sec
java.lang.AssertionError: java.lang.AssertionError
java.lang.AssertionError
	at javax.faces.CurrentThreadToServletContext$FactoryManagerCacheKey.initFromFactoryMap(CurrentThreadToServletContext.java:278)
	at javax.faces.CurrentThreadToServletContext$FactoryManagerCacheKey.<init>(CurrentThreadToServletContext.java:256)
	at javax.faces.CurrentThreadToServletContext.getApplicationFactoryManager(CurrentThreadToServletContext.java:104)
	at javax.faces.CurrentThreadToServletContext.getApplicationFactoryManager(CurrentThreadToServletContext.java:97)
	at javax.faces.FactoryFinder.getFactory(FactoryFinder.java:277)
	at javax.faces.context.FacesContext.getCurrentInstance(FacesContext.java:912)
(40 more lines...)
Collapse Failed FlowFacesContextTests testGetMaximumSeverity History
Default Job < 1 sec
java.lang.AssertionError: java.lang.AssertionError
java.lang.AssertionError
	at javax.faces.CurrentThreadToServletContext$FactoryManagerCacheKey.initFromFactoryMap(CurrentThreadToServletContext.java:278)
	at javax.faces.CurrentThreadToServletContext$FactoryManagerCacheKey.<init>(CurrentThreadToServletContext.java:256)
	at javax.faces.CurrentThreadToServletContext.getApplicationFactoryManager(CurrentThreadToServletContext.java:104)
	at javax.faces.CurrentThreadToServletContext.getApplicationFactoryManager(CurrentThreadToServletContext.java:97)
	at javax.faces.FactoryFinder.getFactory(FactoryFinder.java:277)
	at javax.faces.context.FacesContext.getCurrentInstance(FacesContext.java:912)
(40 more lines...)
Collapse Failed FlowFacesContextTests testGetClientIdsWithMessages History
Default Job < 1 sec
java.lang.AssertionError: java.lang.AssertionError
java.lang.AssertionError
	at javax.faces.CurrentThreadToServletContext$FactoryManagerCacheKey.initFromFactoryMap(CurrentThreadToServletContext.java:278)
	at javax.faces.CurrentThreadToServletContext$FactoryManagerCacheKey.<init>(CurrentThreadToServletContext.java:256)
	at javax.faces.CurrentThreadToServletContext.getApplicationFactoryManager(CurrentThreadToServletContext.java:104)
	at javax.faces.CurrentThreadToServletContext.getApplicationFactoryManager(CurrentThreadToServletContext.java:97)
	at javax.faces.FactoryFinder.getFactory(FactoryFinder.java:277)
	at javax.faces.context.FacesContext.getCurrentInstance(FacesContext.java:912)
(40 more lines...)
Collapse Failed FlowFacesContextTests testAddMessage History
Default Job < 1 sec
java.lang.AssertionError: java.lang.AssertionError
java.lang.AssertionError
	at javax.faces.CurrentThreadToServletContext$FactoryManagerCacheKey.initFromFactoryMap(CurrentThreadToServletContext.java:278)
	at javax.faces.CurrentThreadToServletContext$FactoryManagerCacheKey.<init>(CurrentThreadToServletContext.java:256)
	at javax.faces.CurrentThreadToServletContext.getApplicationFactoryManager(CurrentThreadToServletContext.java:104)
	at javax.faces.CurrentThreadToServletContext.getApplicationFactoryManager(CurrentThreadToServletContext.java:97)
	at javax.faces.FactoryFinder.getFactory(FactoryFinder.java:277)
	at javax.faces.context.FacesContext.getCurrentInstance(FacesContext.java:912)
(40 more lines...)
Collapse Failed FlowFacesContextTests testGetMessagesByClientId_ForUserMessage History
Default Job < 1 sec
java.lang.AssertionError: java.lang.AssertionError
java.lang.AssertionError
	at javax.faces.CurrentThreadToServletContext$FactoryManagerCacheKey.initFromFactoryMap(CurrentThreadToServletContext.java:278)
	at javax.faces.CurrentThreadToServletContext$FactoryManagerCacheKey.<init>(CurrentThreadToServletContext.java:256)
	at javax.faces.CurrentThreadToServletContext.getApplicationFactoryManager(CurrentThreadToServletContext.java:104)
	at javax.faces.CurrentThreadToServletContext.getApplicationFactoryManager(CurrentThreadToServletContext.java:97)
	at javax.faces.FactoryFinder.getFactory(FactoryFinder.java:277)
	at javax.faces.context.FacesContext.getCurrentInstance(FacesContext.java:912)
(40 more lines...)
Collapse Failed FlowFacesContextTests testCurrentInstance History
Default Job < 1 sec
java.lang.AssertionError: java.lang.AssertionError
java.lang.AssertionError
	at javax.faces.CurrentThreadToServletContext$FactoryManagerCacheKey.initFromFactoryMap(CurrentThreadToServletContext.java:278)
	at javax.faces.CurrentThreadToServletContext$FactoryManagerCacheKey.<init>(CurrentThreadToServletContext.java:256)
	at javax.faces.CurrentThreadToServletContext.getApplicationFactoryManager(CurrentThreadToServletContext.java:104)
	at javax.faces.CurrentThreadToServletContext.getApplicationFactoryManager(CurrentThreadToServletContext.java:97)
	at javax.faces.FactoryFinder.getFactory(FactoryFinder.java:277)
	at javax.faces.context.FacesContext.getCurrentInstance(FacesContext.java:912)
(40 more lines...)
Collapse Failed FlowFacesContextTests testGetAllMessages History
Default Job < 1 sec
java.lang.AssertionError: java.lang.AssertionError
java.lang.AssertionError
	at javax.faces.CurrentThreadToServletContext$FactoryManagerCacheKey.initFromFactoryMap(CurrentThreadToServletContext.java:278)
	at javax.faces.CurrentThreadToServletContext$FactoryManagerCacheKey.<init>(CurrentThreadToServletContext.java:256)
	at javax.faces.CurrentThreadToServletContext.getApplicationFactoryManager(CurrentThreadToServletContext.java:104)
	at javax.faces.CurrentThreadToServletContext.getApplicationFactoryManager(CurrentThreadToServletContext.java:97)
	at javax.faces.FactoryFinder.getFactory(FactoryFinder.java:277)
	at javax.faces.context.FacesContext.getCurrentInstance(FacesContext.java:912)
(40 more lines...)
Collapse Failed FlowFacesContextTests testgetMessagesByClientId_InvalidId History
Default Job < 1 sec
java.lang.AssertionError: java.lang.AssertionError
java.lang.AssertionError
	at javax.faces.CurrentThreadToServletContext$FactoryManagerCacheKey.initFromFactoryMap(CurrentThreadToServletContext.java:278)
	at javax.faces.CurrentThreadToServletContext$FactoryManagerCacheKey.<init>(CurrentThreadToServletContext.java:256)
	at javax.faces.CurrentThreadToServletContext.getApplicationFactoryManager(CurrentThreadToServletContext.java:104)
	at javax.faces.CurrentThreadToServletContext.getApplicationFactoryManager(CurrentThreadToServletContext.java:97)
	at javax.faces.FactoryFinder.getFactory(FactoryFinder.java:277)
	at javax.faces.context.FacesContext.getCurrentInstance(FacesContext.java:912)
(40 more lines...)
Collapse Failed FlowFacesContextTests testGetMessagesByClientId_ForComponent History
Default Job < 1 sec
java.lang.AssertionError: java.lang.AssertionError
java.lang.AssertionError
	at javax.faces.CurrentThreadToServletContext$FactoryManagerCacheKey.initFromFactoryMap(CurrentThreadToServletContext.java:278)
	at javax.faces.CurrentThreadToServletContext$FactoryManagerCacheKey.<init>(CurrentThreadToServletContext.java:256)
	at javax.faces.CurrentThreadToServletContext.getApplicationFactoryManager(CurrentThreadToServletContext.java:104)
	at javax.faces.CurrentThreadToServletContext.getApplicationFactoryManager(CurrentThreadToServletContext.java:97)
	at javax.faces.FactoryFinder.getFactory(FactoryFinder.java:277)
	at javax.faces.context.FacesContext.getCurrentInstance(FacesContext.java:912)
(40 more lines...)
Collapse Failed FlowFacesContextTests testGetGlobalMessagesOnly History
Default Job < 1 sec
java.lang.AssertionError: java.lang.AssertionError
java.lang.AssertionError
	at javax.faces.CurrentThreadToServletContext$FactoryManagerCacheKey.initFromFactoryMap(CurrentThreadToServletContext.java:278)
	at javax.faces.CurrentThreadToServletContext$FactoryManagerCacheKey.<init>(CurrentThreadToServletContext.java:256)
	at javax.faces.CurrentThreadToServletContext.getApplicationFactoryManager(CurrentThreadToServletContext.java:104)
	at javax.faces.CurrentThreadToServletContext.getApplicationFactoryManager(CurrentThreadToServletContext.java:97)
	at javax.faces.FactoryFinder.getFactory(FactoryFinder.java:277)
	at javax.faces.context.FacesContext.getCurrentInstance(FacesContext.java:912)
(40 more lines...)
Collapse Failed FlowResponseStateManagerTests testname History
Default Job < 1 sec
java.lang.AssertionError: java.lang.AssertionError
java.lang.AssertionError
	at javax.faces.CurrentThreadToServletContext$FactoryManagerCacheKey.initFromFactoryMap(CurrentThreadToServletContext.java:278)
	at javax.faces.CurrentThreadToServletContext$FactoryManagerCacheKey.<init>(CurrentThreadToServletContext.java:256)
	at javax.faces.CurrentThreadToServletContext.getApplicationFactoryManager(CurrentThreadToServletContext.java:104)
	at javax.faces.CurrentThreadToServletContext.getApplicationFactoryManager(CurrentThreadToServletContext.java:97)
	at javax.faces.FactoryFinder.getFactory(FactoryFinder.java:277)
	at javax.faces.context.FacesContext.getCurrentInstance(FacesContext.java:912)
(40 more lines...)
Collapse Failed FlowResponseStateManagerTests testGetState History
Default Job < 1 sec
java.lang.AssertionError: java.lang.AssertionError
java.lang.AssertionError
	at javax.faces.CurrentThreadToServletContext$FactoryManagerCacheKey.initFromFactoryMap(CurrentThreadToServletContext.java:278)
	at javax.faces.CurrentThreadToServletContext$FactoryManagerCacheKey.<init>(CurrentThreadToServletContext.java:256)
	at javax.faces.CurrentThreadToServletContext.getApplicationFactoryManager(CurrentThreadToServletContext.java:104)
	at javax.faces.CurrentThreadToServletContext.getApplicationFactoryManager(CurrentThreadToServletContext.java:97)
	at javax.faces.FactoryFinder.getFactory(FactoryFinder.java:277)
	at javax.faces.context.FacesContext.getCurrentInstance(FacesContext.java:912)
(40 more lines...)
Collapse Failed FlowResponseStateManagerTests testWriteFlowSerializedView History
Default Job < 1 sec
java.lang.AssertionError: java.lang.AssertionError
java.lang.AssertionError
	at javax.faces.CurrentThreadToServletContext$FactoryManagerCacheKey.initFromFactoryMap(CurrentThreadToServletContext.java:278)
	at javax.faces.CurrentThreadToServletContext$FactoryManagerCacheKey.<init>(CurrentThreadToServletContext.java:256)
	at javax.faces.CurrentThreadToServletContext.getApplicationFactoryManager(CurrentThreadToServletContext.java:104)
	at javax.faces.CurrentThreadToServletContext.getApplicationFactoryManager(CurrentThreadToServletContext.java:97)
	at javax.faces.FactoryFinder.getFactory(FactoryFinder.java:277)
	at javax.faces.context.FacesContext.getCurrentInstance(FacesContext.java:912)
(40 more lines...)
Collapse Failed JsfAjaxHandlerTests testSendAjaxRedirect History
Default Job < 1 sec
java.lang.AssertionError: java.lang.AssertionError
java.lang.AssertionError
	at javax.faces.CurrentThreadToServletContext$FactoryManagerCacheKey.initFromFactoryMap(CurrentThreadToServletContext.java:278)
	at javax.faces.CurrentThreadToServletContext$FactoryManagerCacheKey.<init>(CurrentThreadToServletContext.java:256)
	at javax.faces.CurrentThreadToServletContext.getApplicationFactoryManager(CurrentThreadToServletContext.java:104)
	at javax.faces.CurrentThreadToServletContext.getApplicationFactoryManager(CurrentThreadToServletContext.java:97)
	at javax.faces.FactoryFinder.getFactory(FactoryFinder.java:277)
	at javax.faces.context.FacesContext.getCurrentInstance(FacesContext.java:912)
(38 more lines...)
Collapse Failed JsfFinalResponseActionTests testRender History
Default Job < 1 sec
java.lang.AssertionError: java.lang.AssertionError
java.lang.AssertionError
	at javax.faces.CurrentThreadToServletContext$FactoryManagerCacheKey.initFromFactoryMap(CurrentThreadToServletContext.java:278)
	at javax.faces.CurrentThreadToServletContext$FactoryManagerCacheKey.<init>(CurrentThreadToServletContext.java:256)
	at javax.faces.CurrentThreadToServletContext.getApplicationFactoryManager(CurrentThreadToServletContext.java:104)
	at javax.faces.CurrentThreadToServletContext.getApplicationFactoryManager(CurrentThreadToServletContext.java:97)
	at javax.faces.FactoryFinder.getFactory(FactoryFinder.java:277)
	at javax.faces.context.FacesContext.getCurrentInstance(FacesContext.java:912)
(39 more lines...)
Collapse Failed JsfManagedBeanAwareELExpressionParserTests testGetJSFBean History
Default Job < 1 sec
java.lang.AssertionError: java.lang.AssertionError
java.lang.AssertionError
	at javax.faces.CurrentThreadToServletContext$FactoryManagerCacheKey.initFromFactoryMap(CurrentThreadToServletContext.java:278)
	at javax.faces.CurrentThreadToServletContext$FactoryManagerCacheKey.<init>(CurrentThreadToServletContext.java:256)
	at javax.faces.CurrentThreadToServletContext.getApplicationFactoryManager(CurrentThreadToServletContext.java:104)
	at javax.faces.CurrentThreadToServletContext.getApplicationFactoryManager(CurrentThreadToServletContext.java:97)
	at javax.faces.FactoryFinder.getFactory(FactoryFinder.java:277)
	at javax.faces.context.FacesContext.getCurrentInstance(FacesContext.java:912)
(40 more lines...)
Collapse Failed JsfManagedBeanPropertyAccessorTests testCanRead History
Default Job < 1 sec
java.lang.AssertionError: java.lang.AssertionError
java.lang.AssertionError
	at javax.faces.CurrentThreadToServletContext$FactoryManagerCacheKey.initFromFactoryMap(CurrentThreadToServletContext.java:278)
	at javax.faces.CurrentThreadToServletContext$FactoryManagerCacheKey.<init>(CurrentThreadToServletContext.java:256)
	at javax.faces.CurrentThreadToServletContext.getApplicationFactoryManager(CurrentThreadToServletContext.java:104)
	at javax.faces.CurrentThreadToServletContext.getApplicationFactoryManager(CurrentThreadToServletContext.java:97)
	at javax.faces.FactoryFinder.getFactory(FactoryFinder.java:277)
	at javax.faces.context.FacesContext.getCurrentInstance(FacesContext.java:912)
(38 more lines...)
Collapse Failed JsfManagedBeanPropertyAccessorTests testCanWrite History
Default Job < 1 sec
java.lang.AssertionError: java.lang.AssertionError
java.lang.AssertionError
	at javax.faces.CurrentThreadToServletContext$FactoryManagerCacheKey.initFromFactoryMap(CurrentThreadToServletContext.java:278)
	at javax.faces.CurrentThreadToServletContext$FactoryManagerCacheKey.<init>(CurrentThreadToServletContext.java:256)
	at javax.faces.CurrentThreadToServletContext.getApplicationFactoryManager(CurrentThreadToServletContext.java:104)
	at javax.faces.CurrentThreadToServletContext.getApplicationFactoryManager(CurrentThreadToServletContext.java:97)
	at javax.faces.FactoryFinder.getFactory(FactoryFinder.java:277)
	at javax.faces.context.FacesContext.getCurrentInstance(FacesContext.java:912)
(38 more lines...)
Collapse Failed JsfManagedBeanPropertyAccessorTests testRead History
Default Job < 1 sec
java.lang.AssertionError: java.lang.AssertionError
java.lang.AssertionError
	at javax.faces.CurrentThreadToServletContext$FactoryManagerCacheKey.initFromFactoryMap(CurrentThreadToServletContext.java:278)
	at javax.faces.CurrentThreadToServletContext$FactoryManagerCacheKey.<init>(CurrentThreadToServletContext.java:256)
	at javax.faces.CurrentThreadToServletContext.getApplicationFactoryManager(CurrentThreadToServletContext.java:104)
	at javax.faces.CurrentThreadToServletContext.getApplicationFactoryManager(CurrentThreadToServletContext.java:97)
	at javax.faces.FactoryFinder.getFactory(FactoryFinder.java:277)
	at javax.faces.context.FacesContext.getCurrentInstance(FacesContext.java:912)
(38 more lines...)
Collapse Failed JsfManagedBeanPropertyAccessorTests testWrite History
Default Job < 1 sec
java.lang.AssertionError: java.lang.AssertionError
java.lang.AssertionError
	at javax.faces.CurrentThreadToServletContext$FactoryManagerCacheKey.initFromFactoryMap(CurrentThreadToServletContext.java:278)
	at javax.faces.CurrentThreadToServletContext$FactoryManagerCacheKey.<init>(CurrentThreadToServletContext.java:256)
	at javax.faces.CurrentThreadToServletContext.getApplicationFactoryManager(CurrentThreadToServletContext.java:104)
	at javax.faces.CurrentThreadToServletContext.getApplicationFactoryManager(CurrentThreadToServletContext.java:97)
	at javax.faces.FactoryFinder.getFactory(FactoryFinder.java:277)
	at javax.faces.context.FacesContext.getCurrentInstance(FacesContext.java:912)
(38 more lines...)
Collapse Failed JsfUtilsTests testBeforeListenersCalledInForwardOrder History
Default Job < 1 sec
java.lang.AssertionError: java.lang.AssertionError
java.lang.AssertionError
	at javax.faces.CurrentThreadToServletContext$FactoryManagerCacheKey.initFromFactoryMap(CurrentThreadToServletContext.java:278)
	at javax.faces.CurrentThreadToServletContext$FactoryManagerCacheKey.<init>(CurrentThreadToServletContext.java:256)
	at javax.faces.CurrentThreadToServletContext.getApplicationFactoryManager(CurrentThreadToServletContext.java:104)
	at javax.faces.CurrentThreadToServletContext.getApplicationFactoryManager(CurrentThreadToServletContext.java:91)
	at javax.faces.FactoryFinder.releaseFactories(FactoryFinder.java:332)
	at org.apache.myfaces.test.base.AbstractJsfTestCase.setUp(AbstractJsfTestCase.java:106)
(35 more lines...)
Collapse Failed JsfUtilsTests testAfterListenersCalledInReverseOrder History
Default Job < 1 sec
java.lang.AssertionError: java.lang.AssertionError
java.lang.AssertionError
	at javax.faces.CurrentThreadToServletContext$FactoryManagerCacheKey.initFromFactoryMap(CurrentThreadToServletContext.java:278)
	at javax.faces.CurrentThreadToServletContext$FactoryManagerCacheKey.<init>(CurrentThreadToServletContext.java:256)
	at javax.faces.CurrentThreadToServletContext.getApplicationFactoryManager(CurrentThreadToServletContext.java:104)
	at javax.faces.CurrentThreadToServletContext.getApplicationFactoryManager(CurrentThreadToServletContext.java:91)
	at javax.faces.FactoryFinder.releaseFactories(FactoryFinder.java:332)
	at org.apache.myfaces.test.base.AbstractJsfTestCase.setUp(AbstractJsfTestCase.java:106)
(35 more lines...)
Collapse Failed JsfUtilsTests testGetUnknowFactory History
Default Job < 1 sec
java.lang.AssertionError: java.lang.AssertionError
java.lang.AssertionError
	at javax.faces.CurrentThreadToServletContext$FactoryManagerCacheKey.initFromFactoryMap(CurrentThreadToServletContext.java:278)
	at javax.faces.CurrentThreadToServletContext$FactoryManagerCacheKey.<init>(CurrentThreadToServletContext.java:256)
	at javax.faces.CurrentThreadToServletContext.getApplicationFactoryManager(CurrentThreadToServletContext.java:104)
	at javax.faces.CurrentThreadToServletContext.getApplicationFactoryManager(CurrentThreadToServletContext.java:91)
	at javax.faces.FactoryFinder.releaseFactories(FactoryFinder.java:332)
	at org.apache.myfaces.test.base.AbstractJsfTestCase.setUp(AbstractJsfTestCase.java:106)
(35 more lines...)
Collapse Failed JsfUtilsTests testGetFactory History
Default Job < 1 sec
java.lang.AssertionError: java.lang.AssertionError
java.lang.AssertionError
	at javax.faces.CurrentThreadToServletContext$FactoryManagerCacheKey.initFromFactoryMap(CurrentThreadToServletContext.java:278)
	at javax.faces.CurrentThreadToServletContext$FactoryManagerCacheKey.<init>(CurrentThreadToServletContext.java:256)
	at javax.faces.CurrentThreadToServletContext.getApplicationFactoryManager(CurrentThreadToServletContext.java:104)
	at javax.faces.CurrentThreadToServletContext.getApplicationFactoryManager(CurrentThreadToServletContext.java:91)
	at javax.faces.FactoryFinder.releaseFactories(FactoryFinder.java:332)
	at org.apache.myfaces.test.base.AbstractJsfTestCase.setUp(AbstractJsfTestCase.java:106)
(35 more lines...)
Collapse Failed JsfViewFactoryTests testGetView_ExceptionsOnPostRestoreStateEvent History
Default Job < 1 sec
java.lang.AssertionError: java.lang.AssertionError
java.lang.AssertionError
	at javax.faces.CurrentThreadToServletContext$FactoryManagerCacheKey.initFromFactoryMap(CurrentThreadToServletContext.java:278)
	at javax.faces.CurrentThreadToServletContext$FactoryManagerCacheKey.<init>(CurrentThreadToServletContext.java:256)
	at javax.faces.CurrentThreadToServletContext.getApplicationFactoryManager(CurrentThreadToServletContext.java:104)
	at javax.faces.CurrentThreadToServletContext.getApplicationFactoryManager(CurrentThreadToServletContext.java:97)
	at javax.faces.FactoryFinder.getFactory(FactoryFinder.java:277)
	at javax.faces.context.FacesContext.getCurrentInstance(FacesContext.java:912)
(39 more lines...)
Collapse Failed JsfViewFactoryTests testGetView_Restore History
Default Job < 1 sec
java.lang.AssertionError: java.lang.AssertionError
java.lang.AssertionError
	at javax.faces.CurrentThreadToServletContext$FactoryManagerCacheKey.initFromFactoryMap(CurrentThreadToServletContext.java:278)
	at javax.faces.CurrentThreadToServletContext$FactoryManagerCacheKey.<init>(CurrentThreadToServletContext.java:256)
	at javax.faces.CurrentThreadToServletContext.getApplicationFactoryManager(CurrentThreadToServletContext.java:104)
	at javax.faces.CurrentThreadToServletContext.getApplicationFactoryManager(CurrentThreadToServletContext.java:97)
	at javax.faces.FactoryFinder.getFactory(FactoryFinder.java:277)
	at javax.faces.context.FacesContext.getCurrentInstance(FacesContext.java:912)
(39 more lines...)
Collapse Failed JsfViewFactoryTests testGetView_ExternalViewRoot History
Default Job < 1 sec
java.lang.AssertionError: java.lang.AssertionError
java.lang.AssertionError
	at javax.faces.CurrentThreadToServletContext$FactoryManagerCacheKey.initFromFactoryMap(CurrentThreadToServletContext.java:278)
	at javax.faces.CurrentThreadToServletContext$FactoryManagerCacheKey.<init>(CurrentThreadToServletContext.java:256)
	at javax.faces.CurrentThreadToServletContext.getApplicationFactoryManager(CurrentThreadToServletContext.java:104)
	at javax.faces.CurrentThreadToServletContext.getApplicationFactoryManager(CurrentThreadToServletContext.java:97)
	at javax.faces.FactoryFinder.getFactory(FactoryFinder.java:277)
	at javax.faces.context.FacesContext.getCurrentInstance(FacesContext.java:912)
(39 more lines...)
Collapse Failed JsfViewFactoryTests testGetView_Restore_Ajax History
Default Job < 1 sec
java.lang.AssertionError: java.lang.AssertionError
java.lang.AssertionError
	at javax.faces.CurrentThreadToServletContext$FactoryManagerCacheKey.initFromFactoryMap(CurrentThreadToServletContext.java:278)
	at javax.faces.CurrentThreadToServletContext$FactoryManagerCacheKey.<init>(CurrentThreadToServletContext.java:256)
	at javax.faces.CurrentThreadToServletContext.getApplicationFactoryManager(CurrentThreadToServletContext.java:104)
	at javax.faces.CurrentThreadToServletContext.getApplicationFactoryManager(CurrentThreadToServletContext.java:97)
	at javax.faces.FactoryFinder.getFactory(FactoryFinder.java:277)
	at javax.faces.context.FacesContext.getCurrentInstance(FacesContext.java:912)
(39 more lines...)
Collapse Failed JsfViewFactoryTests testGetView_RestoreWithBindings History
Default Job < 1 sec
java.lang.AssertionError: java.lang.AssertionError
java.lang.AssertionError
	at javax.faces.CurrentThreadToServletContext$FactoryManagerCacheKey.initFromFactoryMap(CurrentThreadToServletContext.java:278)
	at javax.faces.CurrentThreadToServletContext$FactoryManagerCacheKey.<init>(CurrentThreadToServletContext.java:256)
	at javax.faces.CurrentThreadToServletContext.getApplicationFactoryManager(CurrentThreadToServletContext.java:104)
	at javax.faces.CurrentThreadToServletContext.getApplicationFactoryManager(CurrentThreadToServletContext.java:97)
	at javax.faces.FactoryFinder.getFactory(FactoryFinder.java:277)
	at javax.faces.context.FacesContext.getCurrentInstance(FacesContext.java:912)
(39 more lines...)
Collapse Failed JsfViewFactoryTests testGetView_Create History
Default Job < 1 sec
java.lang.AssertionError: java.lang.AssertionError
java.lang.AssertionError
	at javax.faces.CurrentThreadToServletContext$FactoryManagerCacheKey.initFromFactoryMap(CurrentThreadToServletContext.java:278)
	at javax.faces.CurrentThreadToServletContext$FactoryManagerCacheKey.<init>(CurrentThreadToServletContext.java:256)
	at javax.faces.CurrentThreadToServletContext.getApplicationFactoryManager(CurrentThreadToServletContext.java:104)
	at javax.faces.CurrentThreadToServletContext.getApplicationFactoryManager(CurrentThreadToServletContext.java:97)
	at javax.faces.FactoryFinder.getFactory(FactoryFinder.java:277)
	at javax.faces.context.FacesContext.getCurrentInstance(FacesContext.java:912)
(39 more lines...)
Collapse Failed JsfViewTests testSaveState History
Default Job < 1 sec
java.lang.AssertionError: java.lang.AssertionError
java.lang.AssertionError
	at javax.faces.CurrentThreadToServletContext$FactoryManagerCacheKey.initFromFactoryMap(CurrentThreadToServletContext.java:278)
	at javax.faces.CurrentThreadToServletContext$FactoryManagerCacheKey.<init>(CurrentThreadToServletContext.java:256)
	at javax.faces.CurrentThreadToServletContext.getApplicationFactoryManager(CurrentThreadToServletContext.java:104)
	at javax.faces.CurrentThreadToServletContext.getApplicationFactoryManager(CurrentThreadToServletContext.java:97)
	at javax.faces.FactoryFinder.getFactory(FactoryFinder.java:277)
	at javax.faces.context.FacesContext.getCurrentInstance(FacesContext.java:912)
(38 more lines...)
Collapse Failed JsfViewTests testUserEventQueued_FormSubmitted History
Default Job < 1 sec
java.lang.AssertionError: java.lang.AssertionError
java.lang.AssertionError
	at javax.faces.CurrentThreadToServletContext$FactoryManagerCacheKey.initFromFactoryMap(CurrentThreadToServletContext.java:278)
	at javax.faces.CurrentThreadToServletContext$FactoryManagerCacheKey.<init>(CurrentThreadToServletContext.java:256)
	at javax.faces.CurrentThreadToServletContext.getApplicationFactoryManager(CurrentThreadToServletContext.java:104)
	at javax.faces.CurrentThreadToServletContext.getApplicationFactoryManager(CurrentThreadToServletContext.java:97)
	at javax.faces.FactoryFinder.getFactory(FactoryFinder.java:277)
	at javax.faces.context.FacesContext.getCurrentInstance(FacesContext.java:912)
(38 more lines...)
Collapse Failed JsfViewTests testUserEventQueued_GETRefresh History
Default Job < 1 sec
java.lang.AssertionError: java.lang.AssertionError
java.lang.AssertionError
	at javax.faces.CurrentThreadToServletContext$FactoryManagerCacheKey.initFromFactoryMap(CurrentThreadToServletContext.java:278)
	at javax.faces.CurrentThreadToServletContext$FactoryManagerCacheKey.<init>(CurrentThreadToServletContext.java:256)
	at javax.faces.CurrentThreadToServletContext.getApplicationFactoryManager(CurrentThreadToServletContext.java:104)
	at javax.faces.CurrentThreadToServletContext.getApplicationFactoryManager(CurrentThreadToServletContext.java:97)
	at javax.faces.FactoryFinder.getFactory(FactoryFinder.java:277)
	at javax.faces.context.FacesContext.getCurrentInstance(FacesContext.java:912)
(38 more lines...)
Collapse Failed JsfViewTests testProcessUserEvent_Restored_NoEvent History
Default Job < 1 sec
java.lang.AssertionError: java.lang.AssertionError
java.lang.AssertionError
	at javax.faces.CurrentThreadToServletContext$FactoryManagerCacheKey.initFromFactoryMap(CurrentThreadToServletContext.java:278)
	at javax.faces.CurrentThreadToServletContext$FactoryManagerCacheKey.<init>(CurrentThreadToServletContext.java:256)
	at javax.faces.CurrentThreadToServletContext.getApplicationFactoryManager(CurrentThreadToServletContext.java:104)
	at javax.faces.CurrentThreadToServletContext.getApplicationFactoryManager(CurrentThreadToServletContext.java:97)
	at javax.faces.FactoryFinder.getFactory(FactoryFinder.java:277)
	at javax.faces.context.FacesContext.getCurrentInstance(FacesContext.java:912)
(38 more lines...)
Collapse Failed JsfViewTests testRenderException History
Default Job < 1 sec
java.lang.AssertionError: java.lang.AssertionError
java.lang.AssertionError
	at javax.faces.CurrentThreadToServletContext$FactoryManagerCacheKey.initFromFactoryMap(CurrentThreadToServletContext.java:278)
	at javax.faces.CurrentThreadToServletContext$FactoryManagerCacheKey.<init>(CurrentThreadToServletContext.java:256)
	at javax.faces.CurrentThreadToServletContext.getApplicationFactoryManager(CurrentThreadToServletContext.java:104)
	at javax.faces.CurrentThreadToServletContext.getApplicationFactoryManager(CurrentThreadToServletContext.java:97)
	at javax.faces.FactoryFinder.getFactory(FactoryFinder.java:277)
	at javax.faces.context.FacesContext.getCurrentInstance(FacesContext.java:912)
(38 more lines...)
Collapse Failed JsfViewTests testRender History
Default Job < 1 sec
java.lang.AssertionError: java.lang.AssertionError
java.lang.AssertionError
	at javax.faces.CurrentThreadToServletContext$FactoryManagerCacheKey.initFromFactoryMap(CurrentThreadToServletContext.java:278)
	at javax.faces.CurrentThreadToServletContext$FactoryManagerCacheKey.<init>(CurrentThreadToServletContext.java:256)
	at javax.faces.CurrentThreadToServletContext.getApplicationFactoryManager(CurrentThreadToServletContext.java:104)
	at javax.faces.CurrentThreadToServletContext.getApplicationFactoryManager(CurrentThreadToServletContext.java:97)
	at javax.faces.FactoryFinder.getFactory(FactoryFinder.java:277)
	at javax.faces.context.FacesContext.getCurrentInstance(FacesContext.java:912)
(38 more lines...)
Collapse Failed JsfViewTests testProcessUserEvent_Restored_EventSignaled History
Default Job < 1 sec
java.lang.AssertionError: java.lang.AssertionError
java.lang.AssertionError
	at javax.faces.CurrentThreadToServletContext$FactoryManagerCacheKey.initFromFactoryMap(CurrentThreadToServletContext.java:278)
	at javax.faces.CurrentThreadToServletContext$FactoryManagerCacheKey.<init>(CurrentThreadToServletContext.java:256)
	at javax.faces.CurrentThreadToServletContext.getApplicationFactoryManager(CurrentThreadToServletContext.java:104)
	at javax.faces.CurrentThreadToServletContext.getApplicationFactoryManager(CurrentThreadToServletContext.java:97)
	at javax.faces.FactoryFinder.getFactory(FactoryFinder.java:277)
	at javax.faces.context.FacesContext.getCurrentInstance(FacesContext.java:912)
(38 more lines...)
Collapse Failed MyFacesFlowResponseStateManagerTests testDelegatesIsWriteStateAfterRenderViewRequired History
Default Job < 1 sec
java.lang.AssertionError: java.lang.AssertionError
java.lang.AssertionError
	at javax.faces.CurrentThreadToServletContext$FactoryManagerCacheKey.initFromFactoryMap(CurrentThreadToServletContext.java:278)
	at javax.faces.CurrentThreadToServletContext$FactoryManagerCacheKey.<init>(CurrentThreadToServletContext.java:256)
	at javax.faces.CurrentThreadToServletContext.getApplicationFactoryManager(CurrentThreadToServletContext.java:104)
	at javax.faces.CurrentThreadToServletContext.getApplicationFactoryManager(CurrentThreadToServletContext.java:91)
	at javax.faces.FactoryFinder.releaseFactories(FactoryFinder.java:332)
	at org.apache.myfaces.test.base.AbstractJsfTestCase.setUp(AbstractJsfTestCase.java:106)
(36 more lines...)
Collapse Failed MyFacesFlowResponseStateManagerTests testDelegatesWriteState History
Default Job < 1 sec
java.lang.AssertionError: java.lang.AssertionError
java.lang.AssertionError
	at javax.faces.CurrentThreadToServletContext$FactoryManagerCacheKey.initFromFactoryMap(CurrentThreadToServletContext.java:278)
	at javax.faces.CurrentThreadToServletContext$FactoryManagerCacheKey.<init>(CurrentThreadToServletContext.java:256)
	at javax.faces.CurrentThreadToServletContext.getApplicationFactoryManager(CurrentThreadToServletContext.java:104)
	at javax.faces.CurrentThreadToServletContext.getApplicationFactoryManager(CurrentThreadToServletContext.java:91)
	at javax.faces.FactoryFinder.releaseFactories(FactoryFinder.java:332)
	at org.apache.myfaces.test.base.AbstractJsfTestCase.setUp(AbstractJsfTestCase.java:106)
(36 more lines...)
Collapse Failed MyFacesFlowResponseStateManagerTests testTriggersSaveStateInFlowResponseStateManager History
Default Job < 1 sec
java.lang.AssertionError: java.lang.AssertionError
java.lang.AssertionError
	at javax.faces.CurrentThreadToServletContext$FactoryManagerCacheKey.initFromFactoryMap(CurrentThreadToServletContext.java:278)
	at javax.faces.CurrentThreadToServletContext$FactoryManagerCacheKey.<init>(CurrentThreadToServletContext.java:256)
	at javax.faces.CurrentThreadToServletContext.getApplicationFactoryManager(CurrentThreadToServletContext.java:104)
	at javax.faces.CurrentThreadToServletContext.getApplicationFactoryManager(CurrentThreadToServletContext.java:91)
	at javax.faces.FactoryFinder.releaseFactories(FactoryFinder.java:332)
	at org.apache.myfaces.test.base.AbstractJsfTestCase.setUp(AbstractJsfTestCase.java:106)
(36 more lines...)