Spring Web Flow 2.4.x

Build: #206 failed

Job: Default Job failed

Stages & jobs

  1. Default Stage

Job result summary

Completed
Duration
1 minute
Agent
bamboo-24.af.pivotal.io
Revision
0e0587f0409b96b3f065e17863168ecb46fa945f 0e0587f0409b96b3f065e17863168ecb46fa945f
Total tests
286
Fixed in
#208 (Code changes detected)

Tests

  • 286 tests in total
  • 61 tests failed
  • 61 failures are new
  • 1 second taken in total.
New test failures 61
Status Test Duration
Collapse Failed FacesFlowBuilderServicesBeanDefinitionParserTests testConfigureDefaults History
< 1 sec
java.lang.AssertionError: java.lang.AssertionError
java.lang.AssertionError
	at javax.faces.CurrentThreadToServletContext$FactoryManagerCacheKey.initFromFactoryMap(CurrentThreadToServletContext.java:278)
	at javax.faces.CurrentThreadToServletContext$FactoryManagerCacheKey.<init>(CurrentThreadToServletContext.java:256)
	at javax.faces.CurrentThreadToServletContext.getApplicationFactoryManager(CurrentThreadToServletContext.java:104)
	at javax.faces.CurrentThreadToServletContext.getApplicationFactoryManager(CurrentThreadToServletContext.java:97)
	at javax.faces.FactoryFinder.getFactory(FactoryFinder.java:277)
	at javax.faces.context.FacesContext.getCurrentInstance(FacesContext.java:912)
(40 more lines...)
Collapse Failed FacesFlowBuilderServicesBeanDefinitionParserTests testEnableManagedBeans History
< 1 sec
java.lang.AssertionError: java.lang.AssertionError
java.lang.AssertionError
	at javax.faces.CurrentThreadToServletContext$FactoryManagerCacheKey.initFromFactoryMap(CurrentThreadToServletContext.java:278)
	at javax.faces.CurrentThreadToServletContext$FactoryManagerCacheKey.<init>(CurrentThreadToServletContext.java:256)
	at javax.faces.CurrentThreadToServletContext.getApplicationFactoryManager(CurrentThreadToServletContext.java:104)
	at javax.faces.CurrentThreadToServletContext.getApplicationFactoryManager(CurrentThreadToServletContext.java:97)
	at javax.faces.FactoryFinder.getFactory(FactoryFinder.java:277)
	at javax.faces.context.FacesContext.getCurrentInstance(FacesContext.java:912)
(40 more lines...)
Collapse Failed FacesFlowBuilderServicesBeanDefinitionParserTests testFlowBuilderServicesAllCustomized History
< 1 sec
java.lang.AssertionError: java.lang.AssertionError
java.lang.AssertionError
	at javax.faces.CurrentThreadToServletContext$FactoryManagerCacheKey.initFromFactoryMap(CurrentThreadToServletContext.java:278)
	at javax.faces.CurrentThreadToServletContext$FactoryManagerCacheKey.<init>(CurrentThreadToServletContext.java:256)
	at javax.faces.CurrentThreadToServletContext.getApplicationFactoryManager(CurrentThreadToServletContext.java:104)
	at javax.faces.CurrentThreadToServletContext.getApplicationFactoryManager(CurrentThreadToServletContext.java:97)
	at javax.faces.FactoryFinder.getFactory(FactoryFinder.java:277)
	at javax.faces.context.FacesContext.getCurrentInstance(FacesContext.java:912)
(40 more lines...)
Collapse Failed FacesFlowBuilderServicesBeanDefinitionParserTests testFlowBuilderServicesConversionServiceCustomized History
< 1 sec
java.lang.AssertionError: java.lang.AssertionError
java.lang.AssertionError
	at javax.faces.CurrentThreadToServletContext$FactoryManagerCacheKey.initFromFactoryMap(CurrentThreadToServletContext.java:278)
	at javax.faces.CurrentThreadToServletContext$FactoryManagerCacheKey.<init>(CurrentThreadToServletContext.java:256)
	at javax.faces.CurrentThreadToServletContext.getApplicationFactoryManager(CurrentThreadToServletContext.java:104)
	at javax.faces.CurrentThreadToServletContext.getApplicationFactoryManager(CurrentThreadToServletContext.java:97)
	at javax.faces.FactoryFinder.getFactory(FactoryFinder.java:277)
	at javax.faces.context.FacesContext.getCurrentInstance(FacesContext.java:912)
(40 more lines...)
Collapse Failed FacesFlowBuilderServicesJavaConfigTests testConfigureDefaults History
< 1 sec
java.lang.AssertionError: java.lang.AssertionError
java.lang.AssertionError
	at javax.faces.CurrentThreadToServletContext$FactoryManagerCacheKey.initFromFactoryMap(CurrentThreadToServletContext.java:278)
	at javax.faces.CurrentThreadToServletContext$FactoryManagerCacheKey.<init>(CurrentThreadToServletContext.java:256)
	at javax.faces.CurrentThreadToServletContext.getApplicationFactoryManager(CurrentThreadToServletContext.java:104)
	at javax.faces.CurrentThreadToServletContext.getApplicationFactoryManager(CurrentThreadToServletContext.java:97)
	at javax.faces.FactoryFinder.getFactory(FactoryFinder.java:277)
	at javax.faces.context.FacesContext.getCurrentInstance(FacesContext.java:912)
(40 more lines...)
Collapse Failed FacesFlowBuilderServicesJavaConfigTests testEnableManagedBeans History
< 1 sec
java.lang.AssertionError: java.lang.AssertionError
java.lang.AssertionError
	at javax.faces.CurrentThreadToServletContext$FactoryManagerCacheKey.initFromFactoryMap(CurrentThreadToServletContext.java:278)
	at javax.faces.CurrentThreadToServletContext$FactoryManagerCacheKey.<init>(CurrentThreadToServletContext.java:256)
	at javax.faces.CurrentThreadToServletContext.getApplicationFactoryManager(CurrentThreadToServletContext.java:104)
	at javax.faces.CurrentThreadToServletContext.getApplicationFactoryManager(CurrentThreadToServletContext.java:97)
	at javax.faces.FactoryFinder.getFactory(FactoryFinder.java:277)
	at javax.faces.context.FacesContext.getCurrentInstance(FacesContext.java:912)
(40 more lines...)
Collapse Failed FacesFlowBuilderServicesJavaConfigTests testFlowBuilderServicesAllCustomized History
< 1 sec
java.lang.AssertionError: java.lang.AssertionError
java.lang.AssertionError
	at javax.faces.CurrentThreadToServletContext$FactoryManagerCacheKey.initFromFactoryMap(CurrentThreadToServletContext.java:278)
	at javax.faces.CurrentThreadToServletContext$FactoryManagerCacheKey.<init>(CurrentThreadToServletContext.java:256)
	at javax.faces.CurrentThreadToServletContext.getApplicationFactoryManager(CurrentThreadToServletContext.java:104)
	at javax.faces.CurrentThreadToServletContext.getApplicationFactoryManager(CurrentThreadToServletContext.java:97)
	at javax.faces.FactoryFinder.getFactory(FactoryFinder.java:277)
	at javax.faces.context.FacesContext.getCurrentInstance(FacesContext.java:912)
(40 more lines...)
Collapse Failed FacesFlowBuilderServicesJavaConfigTests testFlowBuilderServicesConversionServiceCustomized History
< 1 sec
java.lang.AssertionError: java.lang.AssertionError
java.lang.AssertionError
	at javax.faces.CurrentThreadToServletContext$FactoryManagerCacheKey.initFromFactoryMap(CurrentThreadToServletContext.java:278)
	at javax.faces.CurrentThreadToServletContext$FactoryManagerCacheKey.<init>(CurrentThreadToServletContext.java:256)
	at javax.faces.CurrentThreadToServletContext.getApplicationFactoryManager(CurrentThreadToServletContext.java:104)
	at javax.faces.CurrentThreadToServletContext.getApplicationFactoryManager(CurrentThreadToServletContext.java:97)
	at javax.faces.FactoryFinder.getFactory(FactoryFinder.java:277)
	at javax.faces.context.FacesContext.getCurrentInstance(FacesContext.java:912)
(40 more lines...)
Collapse Failed ResourcesBeanDefinitionParserTests testConfigureDefaults History
< 1 sec
java.lang.AssertionError: java.lang.AssertionError
java.lang.AssertionError
	at javax.faces.CurrentThreadToServletContext$FactoryManagerCacheKey.initFromFactoryMap(CurrentThreadToServletContext.java:278)
	at javax.faces.CurrentThreadToServletContext$FactoryManagerCacheKey.<init>(CurrentThreadToServletContext.java:256)
	at javax.faces.CurrentThreadToServletContext.getApplicationFactoryManager(CurrentThreadToServletContext.java:104)
	at javax.faces.CurrentThreadToServletContext.getApplicationFactoryManager(CurrentThreadToServletContext.java:91)
	at javax.faces.FactoryFinder.setFactory(FactoryFinder.java:310)
	at org.springframework.faces.webflow.JSFMockHelper$JSFMock.setUp(JSFMockHelper.java:138)
(39 more lines...)
Collapse Failed ResourcesBeanDefinitionParserTests testConfigurePortlet History
< 1 sec
org.springframework.beans.factory.xml.XmlBeanDefinitionStoreException: org.springframework.beans.factory.xml.XmlBeanDefinitionStoreException: Line 9 in XML document from class path resource [org/springframework/faces/config/resources.xml] is invalid; nested exception is org.xml.sax.SAXParseException; lineNumber: 9; columnNumber: 21; cvc-complex-type.2.4.c: The matching wildcard is strict, but no declaration can be found for element 'faces:resources'.
org.springframework.beans.factory.xml.XmlBeanDefinitionStoreException: Line 9 in XML document from class path resource [org/springframework/faces/config/resources.xml] is invalid; nested exception is org.xml.sax.SAXParseException; lineNumber: 9; columnNumber: 21; cvc-complex-type.2.4.c: The matching wildcard is strict, but no declaration can be found for element 'faces:resources'.
	at org.springframework.beans.factory.xml.XmlBeanDefinitionReader.doLoadBeanDefinitions(XmlBeanDefinitionReader.java:399)
	at org.springframework.beans.factory.xml.XmlBeanDefinitionReader.loadBeanDefinitions(XmlBeanDefinitionReader.java:336)
	at org.springframework.beans.factory.xml.XmlBeanDefinitionReader.loadBeanDefinitions(XmlBeanDefinitionReader.java:304)
	at org.springframework.beans.factory.support.AbstractBeanDefinitionReader.loadBeanDefinitions(AbstractBeanDefinitionReader.java:181)
	at org.springframework.beans.factory.support.AbstractBeanDefinitionReader.loadBeanDefinitions(AbstractBeanDefinitionReader.java:217)
	at org.springframework.beans.factory.support.AbstractBeanDefinitionReader.loadBeanDefinitions(AbstractBeanDefinitionReader.java:188)
(72 more lines...)
Collapse Failed SelectionTrackingActionListenerTests testProcessActionWithUIData History
< 1 sec
java.lang.AssertionError: java.lang.AssertionError
java.lang.AssertionError
	at javax.faces.CurrentThreadToServletContext$FactoryManagerCacheKey.initFromFactoryMap(CurrentThreadToServletContext.java:278)
	at javax.faces.CurrentThreadToServletContext$FactoryManagerCacheKey.<init>(CurrentThreadToServletContext.java:256)
	at javax.faces.CurrentThreadToServletContext.getApplicationFactoryManager(CurrentThreadToServletContext.java:104)
	at javax.faces.CurrentThreadToServletContext.getApplicationFactoryManager(CurrentThreadToServletContext.java:97)
	at javax.faces.FactoryFinder.getFactory(FactoryFinder.java:277)
	at javax.faces.context.FacesContext.getCurrentInstance(FacesContext.java:912)
(40 more lines...)
Collapse Failed SelectionTrackingActionListenerTests testProcessActionWithUIRepeat History
< 1 sec
java.lang.AssertionError: java.lang.AssertionError
java.lang.AssertionError
	at javax.faces.CurrentThreadToServletContext$FactoryManagerCacheKey.initFromFactoryMap(CurrentThreadToServletContext.java:278)
	at javax.faces.CurrentThreadToServletContext$FactoryManagerCacheKey.<init>(CurrentThreadToServletContext.java:256)
	at javax.faces.CurrentThreadToServletContext.getApplicationFactoryManager(CurrentThreadToServletContext.java:104)
	at javax.faces.CurrentThreadToServletContext.getApplicationFactoryManager(CurrentThreadToServletContext.java:97)
	at javax.faces.FactoryFinder.getFactory(FactoryFinder.java:277)
	at javax.faces.context.FacesContext.getCurrentInstance(FacesContext.java:912)
(40 more lines...)
Collapse Failed JsfViewTests testViewRender History
< 1 sec
java.lang.AssertionError: java.lang.AssertionError
java.lang.AssertionError
	at javax.faces.CurrentThreadToServletContext$FactoryManagerCacheKey.initFromFactoryMap(CurrentThreadToServletContext.java:278)
	at javax.faces.CurrentThreadToServletContext$FactoryManagerCacheKey.<init>(CurrentThreadToServletContext.java:256)
	at javax.faces.CurrentThreadToServletContext.getApplicationFactoryManager(CurrentThreadToServletContext.java:104)
	at javax.faces.CurrentThreadToServletContext.getApplicationFactoryManager(CurrentThreadToServletContext.java:97)
	at javax.faces.FactoryFinder.getFactory(FactoryFinder.java:277)
	at javax.faces.context.FacesContext.getCurrentInstance(FacesContext.java:912)
(40 more lines...)
Collapse Failed JsfViewTests testViewResolution History
< 1 sec
java.lang.AssertionError: java.lang.AssertionError
java.lang.AssertionError
	at javax.faces.CurrentThreadToServletContext$FactoryManagerCacheKey.initFromFactoryMap(CurrentThreadToServletContext.java:278)
	at javax.faces.CurrentThreadToServletContext$FactoryManagerCacheKey.<init>(CurrentThreadToServletContext.java:256)
	at javax.faces.CurrentThreadToServletContext.getApplicationFactoryManager(CurrentThreadToServletContext.java:104)
	at javax.faces.CurrentThreadToServletContext.getApplicationFactoryManager(CurrentThreadToServletContext.java:97)
	at javax.faces.FactoryFinder.getFactory(FactoryFinder.java:277)
	at javax.faces.context.FacesContext.getCurrentInstance(FacesContext.java:912)
(40 more lines...)
Collapse Failed FlowActionListenerTests testProcessAction History
< 1 sec
java.lang.AssertionError: java.lang.AssertionError
java.lang.AssertionError
	at javax.faces.CurrentThreadToServletContext$FactoryManagerCacheKey.initFromFactoryMap(CurrentThreadToServletContext.java:278)
	at javax.faces.CurrentThreadToServletContext$FactoryManagerCacheKey.<init>(CurrentThreadToServletContext.java:256)
	at javax.faces.CurrentThreadToServletContext.getApplicationFactoryManager(CurrentThreadToServletContext.java:104)
	at javax.faces.CurrentThreadToServletContext.getApplicationFactoryManager(CurrentThreadToServletContext.java:97)
	at javax.faces.FactoryFinder.getFactory(FactoryFinder.java:277)
	at javax.faces.context.FacesContext.getCurrentInstance(FacesContext.java:912)
(40 more lines...)
Collapse Failed FlowActionListenerTests testProcessAction_NullOutcome History
< 1 sec
java.lang.AssertionError: java.lang.AssertionError
java.lang.AssertionError
	at javax.faces.CurrentThreadToServletContext$FactoryManagerCacheKey.initFromFactoryMap(CurrentThreadToServletContext.java:278)
	at javax.faces.CurrentThreadToServletContext$FactoryManagerCacheKey.<init>(CurrentThreadToServletContext.java:256)
	at javax.faces.CurrentThreadToServletContext.getApplicationFactoryManager(CurrentThreadToServletContext.java:104)
	at javax.faces.CurrentThreadToServletContext.getApplicationFactoryManager(CurrentThreadToServletContext.java:97)
	at javax.faces.FactoryFinder.getFactory(FactoryFinder.java:277)
	at javax.faces.context.FacesContext.getCurrentInstance(FacesContext.java:912)
(40 more lines...)
Collapse Failed FlowFacesContextTests testAddMessage History
< 1 sec
java.lang.AssertionError: java.lang.AssertionError
java.lang.AssertionError
	at javax.faces.CurrentThreadToServletContext$FactoryManagerCacheKey.initFromFactoryMap(CurrentThreadToServletContext.java:278)
	at javax.faces.CurrentThreadToServletContext$FactoryManagerCacheKey.<init>(CurrentThreadToServletContext.java:256)
	at javax.faces.CurrentThreadToServletContext.getApplicationFactoryManager(CurrentThreadToServletContext.java:104)
	at javax.faces.CurrentThreadToServletContext.getApplicationFactoryManager(CurrentThreadToServletContext.java:97)
	at javax.faces.FactoryFinder.getFactory(FactoryFinder.java:277)
	at javax.faces.context.FacesContext.getCurrentInstance(FacesContext.java:912)
(40 more lines...)
Collapse Failed FlowFacesContextTests testAddMessages_MultipleNullIds History
< 1 sec
java.lang.AssertionError: java.lang.AssertionError
java.lang.AssertionError
	at javax.faces.CurrentThreadToServletContext$FactoryManagerCacheKey.initFromFactoryMap(CurrentThreadToServletContext.java:278)
	at javax.faces.CurrentThreadToServletContext$FactoryManagerCacheKey.<init>(CurrentThreadToServletContext.java:256)
	at javax.faces.CurrentThreadToServletContext.getApplicationFactoryManager(CurrentThreadToServletContext.java:104)
	at javax.faces.CurrentThreadToServletContext.getApplicationFactoryManager(CurrentThreadToServletContext.java:97)
	at javax.faces.FactoryFinder.getFactory(FactoryFinder.java:277)
	at javax.faces.context.FacesContext.getCurrentInstance(FacesContext.java:912)
(40 more lines...)
Collapse Failed FlowFacesContextTests testCurrentInstance History
< 1 sec
java.lang.AssertionError: java.lang.AssertionError
java.lang.AssertionError
	at javax.faces.CurrentThreadToServletContext$FactoryManagerCacheKey.initFromFactoryMap(CurrentThreadToServletContext.java:278)
	at javax.faces.CurrentThreadToServletContext$FactoryManagerCacheKey.<init>(CurrentThreadToServletContext.java:256)
	at javax.faces.CurrentThreadToServletContext.getApplicationFactoryManager(CurrentThreadToServletContext.java:104)
	at javax.faces.CurrentThreadToServletContext.getApplicationFactoryManager(CurrentThreadToServletContext.java:97)
	at javax.faces.FactoryFinder.getFactory(FactoryFinder.java:277)
	at javax.faces.context.FacesContext.getCurrentInstance(FacesContext.java:912)
(40 more lines...)
Collapse Failed FlowFacesContextTests testGetAllMessages History
< 1 sec
java.lang.AssertionError: java.lang.AssertionError
java.lang.AssertionError
	at javax.faces.CurrentThreadToServletContext$FactoryManagerCacheKey.initFromFactoryMap(CurrentThreadToServletContext.java:278)
	at javax.faces.CurrentThreadToServletContext$FactoryManagerCacheKey.<init>(CurrentThreadToServletContext.java:256)
	at javax.faces.CurrentThreadToServletContext.getApplicationFactoryManager(CurrentThreadToServletContext.java:104)
	at javax.faces.CurrentThreadToServletContext.getApplicationFactoryManager(CurrentThreadToServletContext.java:97)
	at javax.faces.FactoryFinder.getFactory(FactoryFinder.java:277)
	at javax.faces.context.FacesContext.getCurrentInstance(FacesContext.java:912)
(40 more lines...)
Collapse Failed FlowFacesContextTests testGetClientIdsWithMessages History
< 1 sec
java.lang.AssertionError: java.lang.AssertionError
java.lang.AssertionError
	at javax.faces.CurrentThreadToServletContext$FactoryManagerCacheKey.initFromFactoryMap(CurrentThreadToServletContext.java:278)
	at javax.faces.CurrentThreadToServletContext$FactoryManagerCacheKey.<init>(CurrentThreadToServletContext.java:256)
	at javax.faces.CurrentThreadToServletContext.getApplicationFactoryManager(CurrentThreadToServletContext.java:104)
	at javax.faces.CurrentThreadToServletContext.getApplicationFactoryManager(CurrentThreadToServletContext.java:97)
	at javax.faces.FactoryFinder.getFactory(FactoryFinder.java:277)
	at javax.faces.context.FacesContext.getCurrentInstance(FacesContext.java:912)
(40 more lines...)
Collapse Failed FlowFacesContextTests testGetELContext History
< 1 sec
java.lang.AssertionError: java.lang.AssertionError
java.lang.AssertionError
	at javax.faces.CurrentThreadToServletContext$FactoryManagerCacheKey.initFromFactoryMap(CurrentThreadToServletContext.java:278)
	at javax.faces.CurrentThreadToServletContext$FactoryManagerCacheKey.<init>(CurrentThreadToServletContext.java:256)
	at javax.faces.CurrentThreadToServletContext.getApplicationFactoryManager(CurrentThreadToServletContext.java:104)
	at javax.faces.CurrentThreadToServletContext.getApplicationFactoryManager(CurrentThreadToServletContext.java:97)
	at javax.faces.FactoryFinder.getFactory(FactoryFinder.java:277)
	at javax.faces.context.FacesContext.getCurrentInstance(FacesContext.java:912)
(40 more lines...)
Collapse Failed FlowFacesContextTests testGetGlobalMessagesOnly History
< 1 sec
java.lang.AssertionError: java.lang.AssertionError
java.lang.AssertionError
	at javax.faces.CurrentThreadToServletContext$FactoryManagerCacheKey.initFromFactoryMap(CurrentThreadToServletContext.java:278)
	at javax.faces.CurrentThreadToServletContext$FactoryManagerCacheKey.<init>(CurrentThreadToServletContext.java:256)
	at javax.faces.CurrentThreadToServletContext.getApplicationFactoryManager(CurrentThreadToServletContext.java:104)
	at javax.faces.CurrentThreadToServletContext.getApplicationFactoryManager(CurrentThreadToServletContext.java:97)
	at javax.faces.FactoryFinder.getFactory(FactoryFinder.java:277)
	at javax.faces.context.FacesContext.getCurrentInstance(FacesContext.java:912)
(40 more lines...)
Collapse Failed FlowFacesContextTests testGetMaximumSeverity History
< 1 sec
java.lang.AssertionError: java.lang.AssertionError
java.lang.AssertionError
	at javax.faces.CurrentThreadToServletContext$FactoryManagerCacheKey.initFromFactoryMap(CurrentThreadToServletContext.java:278)
	at javax.faces.CurrentThreadToServletContext$FactoryManagerCacheKey.<init>(CurrentThreadToServletContext.java:256)
	at javax.faces.CurrentThreadToServletContext.getApplicationFactoryManager(CurrentThreadToServletContext.java:104)
	at javax.faces.CurrentThreadToServletContext.getApplicationFactoryManager(CurrentThreadToServletContext.java:97)
	at javax.faces.FactoryFinder.getFactory(FactoryFinder.java:277)
	at javax.faces.context.FacesContext.getCurrentInstance(FacesContext.java:912)
(40 more lines...)
Collapse Failed FlowFacesContextTests testGetMessages History
< 1 sec
java.lang.AssertionError: java.lang.AssertionError
java.lang.AssertionError
	at javax.faces.CurrentThreadToServletContext$FactoryManagerCacheKey.initFromFactoryMap(CurrentThreadToServletContext.java:278)
	at javax.faces.CurrentThreadToServletContext$FactoryManagerCacheKey.<init>(CurrentThreadToServletContext.java:256)
	at javax.faces.CurrentThreadToServletContext.getApplicationFactoryManager(CurrentThreadToServletContext.java:104)
	at javax.faces.CurrentThreadToServletContext.getApplicationFactoryManager(CurrentThreadToServletContext.java:97)
	at javax.faces.FactoryFinder.getFactory(FactoryFinder.java:277)
	at javax.faces.context.FacesContext.getCurrentInstance(FacesContext.java:912)
(40 more lines...)
Collapse Failed FlowFacesContextTests testGetMessagesByClientId_ForComponent History
< 1 sec
java.lang.AssertionError: java.lang.AssertionError
java.lang.AssertionError
	at javax.faces.CurrentThreadToServletContext$FactoryManagerCacheKey.initFromFactoryMap(CurrentThreadToServletContext.java:278)
	at javax.faces.CurrentThreadToServletContext$FactoryManagerCacheKey.<init>(CurrentThreadToServletContext.java:256)
	at javax.faces.CurrentThreadToServletContext.getApplicationFactoryManager(CurrentThreadToServletContext.java:104)
	at javax.faces.CurrentThreadToServletContext.getApplicationFactoryManager(CurrentThreadToServletContext.java:97)
	at javax.faces.FactoryFinder.getFactory(FactoryFinder.java:277)
	at javax.faces.context.FacesContext.getCurrentInstance(FacesContext.java:912)
(40 more lines...)
Collapse Failed FlowFacesContextTests testGetMessagesByClientId_ForUserMessage History
< 1 sec
java.lang.AssertionError: java.lang.AssertionError
java.lang.AssertionError
	at javax.faces.CurrentThreadToServletContext$FactoryManagerCacheKey.initFromFactoryMap(CurrentThreadToServletContext.java:278)
	at javax.faces.CurrentThreadToServletContext$FactoryManagerCacheKey.<init>(CurrentThreadToServletContext.java:256)
	at javax.faces.CurrentThreadToServletContext.getApplicationFactoryManager(CurrentThreadToServletContext.java:104)
	at javax.faces.CurrentThreadToServletContext.getApplicationFactoryManager(CurrentThreadToServletContext.java:97)
	at javax.faces.FactoryFinder.getFactory(FactoryFinder.java:277)
	at javax.faces.context.FacesContext.getCurrentInstance(FacesContext.java:912)
(40 more lines...)
Collapse Failed FlowFacesContextTests testMessagesAreSerializable History
< 1 sec
java.lang.AssertionError: java.lang.AssertionError
java.lang.AssertionError
	at javax.faces.CurrentThreadToServletContext$FactoryManagerCacheKey.initFromFactoryMap(CurrentThreadToServletContext.java:278)
	at javax.faces.CurrentThreadToServletContext$FactoryManagerCacheKey.<init>(CurrentThreadToServletContext.java:256)
	at javax.faces.CurrentThreadToServletContext.getApplicationFactoryManager(CurrentThreadToServletContext.java:104)
	at javax.faces.CurrentThreadToServletContext.getApplicationFactoryManager(CurrentThreadToServletContext.java:97)
	at javax.faces.FactoryFinder.getFactory(FactoryFinder.java:277)
	at javax.faces.context.FacesContext.getCurrentInstance(FacesContext.java:912)
(40 more lines...)
Collapse Failed FlowFacesContextTests testMutableGetMessages History
< 1 sec
java.lang.AssertionError: java.lang.AssertionError
java.lang.AssertionError
	at javax.faces.CurrentThreadToServletContext$FactoryManagerCacheKey.initFromFactoryMap(CurrentThreadToServletContext.java:278)
	at javax.faces.CurrentThreadToServletContext$FactoryManagerCacheKey.<init>(CurrentThreadToServletContext.java:256)
	at javax.faces.CurrentThreadToServletContext.getApplicationFactoryManager(CurrentThreadToServletContext.java:104)
	at javax.faces.CurrentThreadToServletContext.getApplicationFactoryManager(CurrentThreadToServletContext.java:97)
	at javax.faces.FactoryFinder.getFactory(FactoryFinder.java:277)
	at javax.faces.context.FacesContext.getCurrentInstance(FacesContext.java:912)
(40 more lines...)
Collapse Failed FlowFacesContextTests testValidationFailed History
< 1 sec
java.lang.AssertionError: java.lang.AssertionError
java.lang.AssertionError
	at javax.faces.CurrentThreadToServletContext$FactoryManagerCacheKey.initFromFactoryMap(CurrentThreadToServletContext.java:278)
	at javax.faces.CurrentThreadToServletContext$FactoryManagerCacheKey.<init>(CurrentThreadToServletContext.java:256)
	at javax.faces.CurrentThreadToServletContext.getApplicationFactoryManager(CurrentThreadToServletContext.java:104)
	at javax.faces.CurrentThreadToServletContext.getApplicationFactoryManager(CurrentThreadToServletContext.java:97)
	at javax.faces.FactoryFinder.getFactory(FactoryFinder.java:277)
	at javax.faces.context.FacesContext.getCurrentInstance(FacesContext.java:912)
(40 more lines...)
Collapse Failed FlowFacesContextTests testgetMessagesByClientId_InvalidId History
< 1 sec
java.lang.AssertionError: java.lang.AssertionError
java.lang.AssertionError
	at javax.faces.CurrentThreadToServletContext$FactoryManagerCacheKey.initFromFactoryMap(CurrentThreadToServletContext.java:278)
	at javax.faces.CurrentThreadToServletContext$FactoryManagerCacheKey.<init>(CurrentThreadToServletContext.java:256)
	at javax.faces.CurrentThreadToServletContext.getApplicationFactoryManager(CurrentThreadToServletContext.java:104)
	at javax.faces.CurrentThreadToServletContext.getApplicationFactoryManager(CurrentThreadToServletContext.java:97)
	at javax.faces.FactoryFinder.getFactory(FactoryFinder.java:277)
	at javax.faces.context.FacesContext.getCurrentInstance(FacesContext.java:912)
(40 more lines...)
Collapse Failed FlowResponseStateManagerTests testGetState History
< 1 sec
java.lang.AssertionError: java.lang.AssertionError
java.lang.AssertionError
	at javax.faces.CurrentThreadToServletContext$FactoryManagerCacheKey.initFromFactoryMap(CurrentThreadToServletContext.java:278)
	at javax.faces.CurrentThreadToServletContext$FactoryManagerCacheKey.<init>(CurrentThreadToServletContext.java:256)
	at javax.faces.CurrentThreadToServletContext.getApplicationFactoryManager(CurrentThreadToServletContext.java:104)
	at javax.faces.CurrentThreadToServletContext.getApplicationFactoryManager(CurrentThreadToServletContext.java:97)
	at javax.faces.FactoryFinder.getFactory(FactoryFinder.java:277)
	at javax.faces.context.FacesContext.getCurrentInstance(FacesContext.java:912)
(40 more lines...)
Collapse Failed FlowResponseStateManagerTests testWriteFlowSerializedView History
< 1 sec
java.lang.AssertionError: java.lang.AssertionError
java.lang.AssertionError
	at javax.faces.CurrentThreadToServletContext$FactoryManagerCacheKey.initFromFactoryMap(CurrentThreadToServletContext.java:278)
	at javax.faces.CurrentThreadToServletContext$FactoryManagerCacheKey.<init>(CurrentThreadToServletContext.java:256)
	at javax.faces.CurrentThreadToServletContext.getApplicationFactoryManager(CurrentThreadToServletContext.java:104)
	at javax.faces.CurrentThreadToServletContext.getApplicationFactoryManager(CurrentThreadToServletContext.java:97)
	at javax.faces.FactoryFinder.getFactory(FactoryFinder.java:277)
	at javax.faces.context.FacesContext.getCurrentInstance(FacesContext.java:912)
(40 more lines...)
Collapse Failed FlowResponseStateManagerTests testname History
< 1 sec
java.lang.AssertionError: java.lang.AssertionError
java.lang.AssertionError
	at javax.faces.CurrentThreadToServletContext$FactoryManagerCacheKey.initFromFactoryMap(CurrentThreadToServletContext.java:278)
	at javax.faces.CurrentThreadToServletContext$FactoryManagerCacheKey.<init>(CurrentThreadToServletContext.java:256)
	at javax.faces.CurrentThreadToServletContext.getApplicationFactoryManager(CurrentThreadToServletContext.java:104)
	at javax.faces.CurrentThreadToServletContext.getApplicationFactoryManager(CurrentThreadToServletContext.java:97)
	at javax.faces.FactoryFinder.getFactory(FactoryFinder.java:277)
	at javax.faces.context.FacesContext.getCurrentInstance(FacesContext.java:912)
(40 more lines...)
Collapse Failed JsfAjaxHandlerTests testSendAjaxRedirect History
< 1 sec
java.lang.AssertionError: java.lang.AssertionError
java.lang.AssertionError
	at javax.faces.CurrentThreadToServletContext$FactoryManagerCacheKey.initFromFactoryMap(CurrentThreadToServletContext.java:278)
	at javax.faces.CurrentThreadToServletContext$FactoryManagerCacheKey.<init>(CurrentThreadToServletContext.java:256)
	at javax.faces.CurrentThreadToServletContext.getApplicationFactoryManager(CurrentThreadToServletContext.java:104)
	at javax.faces.CurrentThreadToServletContext.getApplicationFactoryManager(CurrentThreadToServletContext.java:97)
	at javax.faces.FactoryFinder.getFactory(FactoryFinder.java:277)
	at javax.faces.context.FacesContext.getCurrentInstance(FacesContext.java:912)
(38 more lines...)
Collapse Failed JsfFinalResponseActionTests testRender History
< 1 sec
java.lang.AssertionError: java.lang.AssertionError
java.lang.AssertionError
	at javax.faces.CurrentThreadToServletContext$FactoryManagerCacheKey.initFromFactoryMap(CurrentThreadToServletContext.java:278)
	at javax.faces.CurrentThreadToServletContext$FactoryManagerCacheKey.<init>(CurrentThreadToServletContext.java:256)
	at javax.faces.CurrentThreadToServletContext.getApplicationFactoryManager(CurrentThreadToServletContext.java:104)
	at javax.faces.CurrentThreadToServletContext.getApplicationFactoryManager(CurrentThreadToServletContext.java:97)
	at javax.faces.FactoryFinder.getFactory(FactoryFinder.java:277)
	at javax.faces.context.FacesContext.getCurrentInstance(FacesContext.java:912)
(39 more lines...)
Collapse Failed JsfManagedBeanAwareELExpressionParserTests testGetJSFBean History
< 1 sec
java.lang.AssertionError: java.lang.AssertionError
java.lang.AssertionError
	at javax.faces.CurrentThreadToServletContext$FactoryManagerCacheKey.initFromFactoryMap(CurrentThreadToServletContext.java:278)
	at javax.faces.CurrentThreadToServletContext$FactoryManagerCacheKey.<init>(CurrentThreadToServletContext.java:256)
	at javax.faces.CurrentThreadToServletContext.getApplicationFactoryManager(CurrentThreadToServletContext.java:104)
	at javax.faces.CurrentThreadToServletContext.getApplicationFactoryManager(CurrentThreadToServletContext.java:97)
	at javax.faces.FactoryFinder.getFactory(FactoryFinder.java:277)
	at javax.faces.context.FacesContext.getCurrentInstance(FacesContext.java:912)
(40 more lines...)
Collapse Failed JsfManagedBeanPropertyAccessorTests testCanRead History
< 1 sec
java.lang.AssertionError: java.lang.AssertionError
java.lang.AssertionError
	at javax.faces.CurrentThreadToServletContext$FactoryManagerCacheKey.initFromFactoryMap(CurrentThreadToServletContext.java:278)
	at javax.faces.CurrentThreadToServletContext$FactoryManagerCacheKey.<init>(CurrentThreadToServletContext.java:256)
	at javax.faces.CurrentThreadToServletContext.getApplicationFactoryManager(CurrentThreadToServletContext.java:104)
	at javax.faces.CurrentThreadToServletContext.getApplicationFactoryManager(CurrentThreadToServletContext.java:97)
	at javax.faces.FactoryFinder.getFactory(FactoryFinder.java:277)
	at javax.faces.context.FacesContext.getCurrentInstance(FacesContext.java:912)
(38 more lines...)
Collapse Failed JsfManagedBeanPropertyAccessorTests testCanWrite History
< 1 sec
java.lang.AssertionError: java.lang.AssertionError
java.lang.AssertionError
	at javax.faces.CurrentThreadToServletContext$FactoryManagerCacheKey.initFromFactoryMap(CurrentThreadToServletContext.java:278)
	at javax.faces.CurrentThreadToServletContext$FactoryManagerCacheKey.<init>(CurrentThreadToServletContext.java:256)
	at javax.faces.CurrentThreadToServletContext.getApplicationFactoryManager(CurrentThreadToServletContext.java:104)
	at javax.faces.CurrentThreadToServletContext.getApplicationFactoryManager(CurrentThreadToServletContext.java:97)
	at javax.faces.FactoryFinder.getFactory(FactoryFinder.java:277)
	at javax.faces.context.FacesContext.getCurrentInstance(FacesContext.java:912)
(38 more lines...)
Collapse Failed JsfManagedBeanPropertyAccessorTests testRead History
< 1 sec
java.lang.AssertionError: java.lang.AssertionError
java.lang.AssertionError
	at javax.faces.CurrentThreadToServletContext$FactoryManagerCacheKey.initFromFactoryMap(CurrentThreadToServletContext.java:278)
	at javax.faces.CurrentThreadToServletContext$FactoryManagerCacheKey.<init>(CurrentThreadToServletContext.java:256)
	at javax.faces.CurrentThreadToServletContext.getApplicationFactoryManager(CurrentThreadToServletContext.java:104)
	at javax.faces.CurrentThreadToServletContext.getApplicationFactoryManager(CurrentThreadToServletContext.java:97)
	at javax.faces.FactoryFinder.getFactory(FactoryFinder.java:277)
	at javax.faces.context.FacesContext.getCurrentInstance(FacesContext.java:912)
(38 more lines...)
Collapse Failed JsfManagedBeanPropertyAccessorTests testWrite History
< 1 sec
java.lang.AssertionError: java.lang.AssertionError
java.lang.AssertionError
	at javax.faces.CurrentThreadToServletContext$FactoryManagerCacheKey.initFromFactoryMap(CurrentThreadToServletContext.java:278)
	at javax.faces.CurrentThreadToServletContext$FactoryManagerCacheKey.<init>(CurrentThreadToServletContext.java:256)
	at javax.faces.CurrentThreadToServletContext.getApplicationFactoryManager(CurrentThreadToServletContext.java:104)
	at javax.faces.CurrentThreadToServletContext.getApplicationFactoryManager(CurrentThreadToServletContext.java:97)
	at javax.faces.FactoryFinder.getFactory(FactoryFinder.java:277)
	at javax.faces.context.FacesContext.getCurrentInstance(FacesContext.java:912)
(38 more lines...)
Collapse Failed JsfUtilsTests testAfterListenersCalledInReverseOrder History
< 1 sec
java.lang.AssertionError: java.lang.AssertionError
java.lang.AssertionError
	at javax.faces.CurrentThreadToServletContext$FactoryManagerCacheKey.initFromFactoryMap(CurrentThreadToServletContext.java:278)
	at javax.faces.CurrentThreadToServletContext$FactoryManagerCacheKey.<init>(CurrentThreadToServletContext.java:256)
	at javax.faces.CurrentThreadToServletContext.getApplicationFactoryManager(CurrentThreadToServletContext.java:104)
	at javax.faces.CurrentThreadToServletContext.getApplicationFactoryManager(CurrentThreadToServletContext.java:91)
	at javax.faces.FactoryFinder.releaseFactories(FactoryFinder.java:332)
	at org.apache.myfaces.test.base.AbstractJsfTestCase.setUp(AbstractJsfTestCase.java:106)
(35 more lines...)
Collapse Failed JsfUtilsTests testBeforeListenersCalledInForwardOrder History
< 1 sec
java.lang.AssertionError: java.lang.AssertionError
java.lang.AssertionError
	at javax.faces.CurrentThreadToServletContext$FactoryManagerCacheKey.initFromFactoryMap(CurrentThreadToServletContext.java:278)
	at javax.faces.CurrentThreadToServletContext$FactoryManagerCacheKey.<init>(CurrentThreadToServletContext.java:256)
	at javax.faces.CurrentThreadToServletContext.getApplicationFactoryManager(CurrentThreadToServletContext.java:104)
	at javax.faces.CurrentThreadToServletContext.getApplicationFactoryManager(CurrentThreadToServletContext.java:91)
	at javax.faces.FactoryFinder.releaseFactories(FactoryFinder.java:332)
	at org.apache.myfaces.test.base.AbstractJsfTestCase.setUp(AbstractJsfTestCase.java:106)
(35 more lines...)
Collapse Failed JsfUtilsTests testGetFactory History
< 1 sec
java.lang.AssertionError: java.lang.AssertionError
java.lang.AssertionError
	at javax.faces.CurrentThreadToServletContext$FactoryManagerCacheKey.initFromFactoryMap(CurrentThreadToServletContext.java:278)
	at javax.faces.CurrentThreadToServletContext$FactoryManagerCacheKey.<init>(CurrentThreadToServletContext.java:256)
	at javax.faces.CurrentThreadToServletContext.getApplicationFactoryManager(CurrentThreadToServletContext.java:104)
	at javax.faces.CurrentThreadToServletContext.getApplicationFactoryManager(CurrentThreadToServletContext.java:91)
	at javax.faces.FactoryFinder.releaseFactories(FactoryFinder.java:332)
	at org.apache.myfaces.test.base.AbstractJsfTestCase.setUp(AbstractJsfTestCase.java:106)
(35 more lines...)
Collapse Failed JsfUtilsTests testGetUnknowFactory History
< 1 sec
java.lang.AssertionError: java.lang.AssertionError
java.lang.AssertionError
	at javax.faces.CurrentThreadToServletContext$FactoryManagerCacheKey.initFromFactoryMap(CurrentThreadToServletContext.java:278)
	at javax.faces.CurrentThreadToServletContext$FactoryManagerCacheKey.<init>(CurrentThreadToServletContext.java:256)
	at javax.faces.CurrentThreadToServletContext.getApplicationFactoryManager(CurrentThreadToServletContext.java:104)
	at javax.faces.CurrentThreadToServletContext.getApplicationFactoryManager(CurrentThreadToServletContext.java:91)
	at javax.faces.FactoryFinder.releaseFactories(FactoryFinder.java:332)
	at org.apache.myfaces.test.base.AbstractJsfTestCase.setUp(AbstractJsfTestCase.java:106)
(35 more lines...)
Collapse Failed JsfViewFactoryTests testGetView_Create History
< 1 sec
java.lang.AssertionError: java.lang.AssertionError
java.lang.AssertionError
	at javax.faces.CurrentThreadToServletContext$FactoryManagerCacheKey.initFromFactoryMap(CurrentThreadToServletContext.java:278)
	at javax.faces.CurrentThreadToServletContext$FactoryManagerCacheKey.<init>(CurrentThreadToServletContext.java:256)
	at javax.faces.CurrentThreadToServletContext.getApplicationFactoryManager(CurrentThreadToServletContext.java:104)
	at javax.faces.CurrentThreadToServletContext.getApplicationFactoryManager(CurrentThreadToServletContext.java:97)
	at javax.faces.FactoryFinder.getFactory(FactoryFinder.java:277)
	at javax.faces.context.FacesContext.getCurrentInstance(FacesContext.java:912)
(39 more lines...)
Collapse Failed JsfViewFactoryTests testGetView_ExceptionsOnPostRestoreStateEvent History
< 1 sec
java.lang.AssertionError: java.lang.AssertionError
java.lang.AssertionError
	at javax.faces.CurrentThreadToServletContext$FactoryManagerCacheKey.initFromFactoryMap(CurrentThreadToServletContext.java:278)
	at javax.faces.CurrentThreadToServletContext$FactoryManagerCacheKey.<init>(CurrentThreadToServletContext.java:256)
	at javax.faces.CurrentThreadToServletContext.getApplicationFactoryManager(CurrentThreadToServletContext.java:104)
	at javax.faces.CurrentThreadToServletContext.getApplicationFactoryManager(CurrentThreadToServletContext.java:97)
	at javax.faces.FactoryFinder.getFactory(FactoryFinder.java:277)
	at javax.faces.context.FacesContext.getCurrentInstance(FacesContext.java:912)
(39 more lines...)
Collapse Failed JsfViewFactoryTests testGetView_ExternalViewRoot History
< 1 sec
java.lang.AssertionError: java.lang.AssertionError
java.lang.AssertionError
	at javax.faces.CurrentThreadToServletContext$FactoryManagerCacheKey.initFromFactoryMap(CurrentThreadToServletContext.java:278)
	at javax.faces.CurrentThreadToServletContext$FactoryManagerCacheKey.<init>(CurrentThreadToServletContext.java:256)
	at javax.faces.CurrentThreadToServletContext.getApplicationFactoryManager(CurrentThreadToServletContext.java:104)
	at javax.faces.CurrentThreadToServletContext.getApplicationFactoryManager(CurrentThreadToServletContext.java:97)
	at javax.faces.FactoryFinder.getFactory(FactoryFinder.java:277)
	at javax.faces.context.FacesContext.getCurrentInstance(FacesContext.java:912)
(39 more lines...)
Collapse Failed JsfViewFactoryTests testGetView_Restore History
< 1 sec
java.lang.AssertionError: java.lang.AssertionError
java.lang.AssertionError
	at javax.faces.CurrentThreadToServletContext$FactoryManagerCacheKey.initFromFactoryMap(CurrentThreadToServletContext.java:278)
	at javax.faces.CurrentThreadToServletContext$FactoryManagerCacheKey.<init>(CurrentThreadToServletContext.java:256)
	at javax.faces.CurrentThreadToServletContext.getApplicationFactoryManager(CurrentThreadToServletContext.java:104)
	at javax.faces.CurrentThreadToServletContext.getApplicationFactoryManager(CurrentThreadToServletContext.java:97)
	at javax.faces.FactoryFinder.getFactory(FactoryFinder.java:277)
	at javax.faces.context.FacesContext.getCurrentInstance(FacesContext.java:912)
(39 more lines...)
Collapse Failed JsfViewFactoryTests testGetView_RestoreWithBindings History
< 1 sec
java.lang.AssertionError: java.lang.AssertionError
java.lang.AssertionError
	at javax.faces.CurrentThreadToServletContext$FactoryManagerCacheKey.initFromFactoryMap(CurrentThreadToServletContext.java:278)
	at javax.faces.CurrentThreadToServletContext$FactoryManagerCacheKey.<init>(CurrentThreadToServletContext.java:256)
	at javax.faces.CurrentThreadToServletContext.getApplicationFactoryManager(CurrentThreadToServletContext.java:104)
	at javax.faces.CurrentThreadToServletContext.getApplicationFactoryManager(CurrentThreadToServletContext.java:97)
	at javax.faces.FactoryFinder.getFactory(FactoryFinder.java:277)
	at javax.faces.context.FacesContext.getCurrentInstance(FacesContext.java:912)
(39 more lines...)

Error summary

The build generated some errors. See the full build log for more details.

        at org.gradle.execution.taskgraph.DefaultTaskGraphExecuter$EventFiringTaskWorker.execute(DefaultTaskGraphExecuter.java:241)
        at org.gradle.execution.taskgraph.DefaultTaskGraphExecuter$EventFiringTaskWorker.execute(DefaultTaskGraphExecuter.java:230)
        at org.gradle.execution.taskgraph.DefaultTaskPlanExecutor$TaskExecutorWorker.processTask(DefaultTaskPlanExecutor.java:123)
        at org.gradle.execution.taskgraph.DefaultTaskPlanExecutor$TaskExecutorWorker.access$200(DefaultTaskPlanExecutor.java:79)
        at org.gradle.execution.taskgraph.DefaultTaskPlanExecutor$TaskExecutorWorker$1.execute(DefaultTaskPlanExecutor.java:104)
        at org.gradle.execution.taskgraph.DefaultTaskPlanExecutor$TaskExecutorWorker$1.execute(DefaultTaskPlanExecutor.java:98)
        at org.gradle.execution.taskgraph.DefaultTaskExecutionPlan.execute(DefaultTaskExecutionPlan.java:626)
        at org.gradle.execution.taskgraph.DefaultTaskExecutionPlan.executeWithTask(DefaultTaskExecutionPlan.java:581)
        at org.gradle.execution.taskgraph.DefaultTaskPlanExecutor$TaskExecutorWorker.run(DefaultTaskPlanExecutor.java:98)
        at org.gradle.execution.taskgraph.DefaultTaskPlanExecutor.process(DefaultTaskPlanExecutor.java:59)
        at org.gradle.execution.taskgraph.DefaultTaskGraphExecuter.execute(DefaultTaskGraphExecuter.java:128)
        at org.gradle.execution.SelectedTaskExecutionAction.execute(SelectedTaskExecutionAction.java:37)
        at org.gradle.execution.DefaultBuildExecuter.execute(DefaultBuildExecuter.java:37)
        at org.gradle.execution.DefaultBuildExecuter.access$000(DefaultBuildExecuter.java:23)
        at org.gradle.execution.DefaultBuildExecuter$1.proceed(DefaultBuildExecuter.java:43)
        at org.gradle.execution.DryRunBuildExecutionAction.execute(DryRunBuildExecutionAction.java:46)
        at org.gradle.execution.DefaultBuildExecuter.execute(DefaultBuildExecuter.java:37)
        at org.gradle.execution.DefaultBuildExecuter.execute(DefaultBuildExecuter.java:30)
        at org.gradle.initialization.DefaultGradleLauncher$ExecuteTasks.run(DefaultGradleLauncher.java:314)
        at org.gradle.internal.progress.DefaultBuildOperationExecutor$RunnableBuildOperationWorker.execute(DefaultBuildOperationExecutor.java:336)
        at org.gradle.internal.progress.DefaultBuildOperationExecutor$RunnableBuildOperationWorker.execute(DefaultBuildOperationExecutor.java:328)
        at org.gradle.internal.progress.DefaultBuildOperationExecutor.execute(DefaultBuildOperationExecutor.java:199)
        at org.gradle.internal.progress.DefaultBuildOperationExecutor.run(DefaultBuildOperationExecutor.java:110)
        at org.gradle.initialization.DefaultGradleLauncher.runTasks(DefaultGradleLauncher.java:204)
        at org.gradle.initialization.DefaultGradleLauncher.doBuildStages(DefaultGradleLauncher.java:134)
        at org.gradle.initialization.DefaultGradleLauncher.executeTasks(DefaultGradleLauncher.java:109)
        at org.gradle.internal.invocation.GradleBuildController$1.call(GradleBuildController.java:78)
        at org.gradle.internal.invocation.GradleBuildController$1.call(GradleBuildController.java:75)
        at org.gradle.internal.work.DefaultWorkerLeaseService.withLocks(DefaultWorkerLeaseService.java:152)
        at org.gradle.internal.invocation.GradleBuildController.doBuild(GradleBuildController.java:100)
        at org.gradle.internal.invocation.GradleBuildController.run(GradleBuildController.java:75)
        at org.gradle.tooling.internal.provider.ExecuteBuildActionRunner.run(ExecuteBuildActionRunner.java:28)
        at org.gradle.launcher.exec.ChainingBuildActionRunner.run(ChainingBuildActionRunner.java:35)
        at org.gradle.tooling.internal.provider.ValidatingBuildActionRunner.run(ValidatingBuildActionRunner.java:32)
        at org.gradle.launcher.exec.RunAsBuildOperationBuildActionRunner$1.run(RunAsBuildOperationBuildActionRunner.java:43)
        at org.gradle.internal.progress.DefaultBuildOperationExecutor$RunnableBuildOperationWorker.execute(DefaultBuildOperationExecutor.java:336)
        at org.gradle.internal.progress.DefaultBuildOperationExecutor$RunnableBuildOperationWorker.execute(DefaultBuildOperationExecutor.java:328)
        at org.gradle.internal.progress.DefaultBuildOperationExecutor.execute(DefaultBuildOperationExecutor.java:199)
        at org.gradle.internal.progress.DefaultBuildOperationExecutor.run(DefaultBuildOperationExecutor.java:110)
        at org.gradle.launcher.exec.RunAsBuildOperationBuildActionRunner.run(RunAsBuildOperationBuildActionRunner.java:40)
        at org.gradle.tooling.internal.provider.SubscribableBuildActionRunner.run(SubscribableBuildActionRunner.java:51)
        at org.gradle.launcher.exec.InProcessBuildActionExecuter.execute(InProcessBuildActionExecuter.java:47)
        at org.gradle.launcher.exec.InProcessBuildActionExecuter.execute(InProcessBuildActionExecuter.java:30)
        at org.gradle.launcher.exec.BuildTreeScopeBuildActionExecuter.execute(BuildTreeScopeBuildActionExecuter.java:39)
        at org.gradle.launcher.exec.BuildTreeScopeBuildActionExecuter.execute(BuildTreeScopeBuildActionExecuter.java:25)
        at org.gradle.tooling.internal.provider.ContinuousBuildActionExecuter.execute(ContinuousBuildActionExecuter.java:80)
        at org.gradle.tooling.internal.provider.ContinuousBuildActionExecuter.execute(ContinuousBuildActionExecuter.java:53)
        at org.gradle.tooling.internal.provider.ServicesSetupBuildActionExecuter.execute(ServicesSetupBuildActionExecuter.java:57)
        at org.gradle.tooling.internal.provider.ServicesSetupBuildActionExecuter.execute(ServicesSetupBuildActionExecuter.java:32)
        at org.gradle.tooling.internal.provider.GradleThreadBuildActionExecuter.execute(GradleThreadBuildActionExecuter.java:36)
        at org.gradle.tooling.internal.provider.GradleThreadBuildActionExecuter.execute(GradleThreadBuildActionExecuter.java:25)
        at org.gradle.tooling.internal.provider.ParallelismConfigurationBuildActionExecuter.execute(ParallelismConfigurationBuildActionExecuter.java:43)
        at org.gradle.tooling.internal.provider.ParallelismConfigurationBuildActionExecuter.execute(ParallelismConfigurationBuildActionExecuter.java:29)
        at org.gradle.tooling.internal.provider.StartParamsValidatingActionExecuter.execute(StartParamsValidatingActionExecuter.java:69)
        at org.gradle.tooling.internal.provider.StartParamsValidatingActionExecuter.execute(StartParamsValidatingActionExecuter.java:30)
        at org.gradle.tooling.internal.provider.SessionFailureReportingActionExecuter.execute(SessionFailureReportingActionExecuter.java:59)
        at org.gradle.tooling.internal.provider.SessionFailureReportingActionExecuter.execute(SessionFailureReportingActionExecuter.java:44)
        at org.gradle.tooling.internal.provider.SetupLoggingActionExecuter.execute(SetupLoggingActionExecuter.java:45)
        at org.gradle.tooling.internal.provider.SetupLoggingActionExecuter.execute(SetupLoggingActionExecuter.java:30)
        at org.gradle.launcher.cli.RunBuildAction.run(RunBuildAction.java:51)
        at org.gradle.internal.Actions$RunnableActionAdapter.execute(Actions.java:173)
        at org.gradle.launcher.cli.CommandLineActionFactory$ParseAndBuildAction.execute(CommandLineActionFactory.java:291)
        at org.gradle.launcher.cli.CommandLineActionFactory$ParseAndBuildAction.execute(CommandLineActionFactory.java:264)
        at org.gradle.launcher.cli.JavaRuntimeValidationAction.execute(JavaRuntimeValidationAction.java:33)
        at org.gradle.launcher.cli.JavaRuntimeValidationAction.execute(JavaRuntimeValidationAction.java:24)
        at org.gradle.launcher.cli.ExceptionReportingAction.execute(ExceptionReportingAction.java:33)
        at org.gradle.launcher.cli.ExceptionReportingAction.execute(ExceptionReportingAction.java:22)
        at org.gradle.launcher.cli.CommandLineActionFactory$WithLogging.execute(CommandLineActionFactory.java:257)
        at org.gradle.launcher.cli.CommandLineActionFactory$WithLogging.execute(CommandLineActionFactory.java:191)
        at org.gradle.launcher.Main.doAction(Main.java:33)
        at org.gradle.launcher.bootstrap.EntryPoint.run(EntryPoint.java:45)
        at org.gradle.launcher.bootstrap.ProcessBootstrap.runNoExit(ProcessBootstrap.java:60)
        at org.gradle.launcher.bootstrap.ProcessBootstrap.run(ProcessBootstrap.java:37)
        at org.gradle.launcher.GradleMain.main(GradleMain.java:23)
        at org.gradle.wrapper.BootstrapMainStarter.start(BootstrapMainStarter.java:30)
        at org.gradle.wrapper.WrapperExecutor.execute(WrapperExecutor.java:127)
        at org.gradle.wrapper.GradleWrapperMain.main(GradleWrapperMain.java:58)
Caused by: org.gradle.api.GradleException: There were failing tests. See the report at: file:///opt/bamboo-home/xml-data/build-dir/SWF-MASTER-JOB1/spring-faces/build/reports/tests/test/index.html
        at org.gradle.api.tasks.testing.AbstractTestTask.handleTestFailures(AbstractTestTask.java:547)
        at org.gradle.api.tasks.testing.AbstractTestTask.executeTests(AbstractTestTask.java:464)
        at org.gradle.api.tasks.testing.Test.executeTests(Test.java:530)
        at org.gradle.internal.reflect.JavaMethod.invoke(JavaMethod.java:73)
        at org.gradle.api.internal.project.taskfactory.StandardTaskAction.doExecute(StandardTaskAction.java:46)
        at org.gradle.api.internal.project.taskfactory.StandardTaskAction.execute(StandardTaskAction.java:39)
        at org.gradle.api.internal.project.taskfactory.StandardTaskAction.execute(StandardTaskAction.java:26)
        at org.gradle.api.internal.AbstractTask$TaskActionWrapper.execute(AbstractTask.java:780)
        at org.gradle.api.internal.AbstractTask$TaskActionWrapper.execute(AbstractTask.java:747)
        at org.gradle.api.internal.tasks.execution.ExecuteActionsTaskExecuter$1.run(ExecuteActionsTaskExecuter.java:121)
        at org.gradle.internal.progress.DefaultBuildOperationExecutor$RunnableBuildOperationWorker.execute(DefaultBuildOperationExecutor.java:336)
        at org.gradle.internal.progress.DefaultBuildOperationExecutor$RunnableBuildOperationWorker.execute(DefaultBuildOperationExecutor.java:328)
        at org.gradle.internal.progress.DefaultBuildOperationExecutor.execute(DefaultBuildOperationExecutor.java:199)
        at org.gradle.internal.progress.DefaultBuildOperationExecutor.run(DefaultBuildOperationExecutor.java:110)
        at org.gradle.api.internal.tasks.execution.ExecuteActionsTaskExecuter.executeAction(ExecuteActionsTaskExecuter.java:110)
        at org.gradle.api.internal.tasks.execution.ExecuteActionsTaskExecuter.executeActions(ExecuteActionsTaskExecuter.java:92)
        ... 94 more


* Get more help at https://help.gradle.org

BUILD FAILED in 1m 14s