Spring Web Flow 2.4.x

Build: #206 failed

Job: Default Job failed

Stages & jobs

  1. Default Stage

Test results

  • 286 tests in total
  • 61 tests failed
  • 61 failures are new
  • 1 second taken in total.

Build 206 has the following 61 errors: 61 new failure(s) occurred since the previous build.

New test failures 61
Status Test Duration
Collapse Failed FacesFlowBuilderServicesBeanDefinitionParserTests testConfigureDefaults History
< 1 sec
java.lang.AssertionError: java.lang.AssertionError
java.lang.AssertionError
	at javax.faces.CurrentThreadToServletContext$FactoryManagerCacheKey.initFromFactoryMap(CurrentThreadToServletContext.java:278)
	at javax.faces.CurrentThreadToServletContext$FactoryManagerCacheKey.<init>(CurrentThreadToServletContext.java:256)
	at javax.faces.CurrentThreadToServletContext.getApplicationFactoryManager(CurrentThreadToServletContext.java:104)
	at javax.faces.CurrentThreadToServletContext.getApplicationFactoryManager(CurrentThreadToServletContext.java:97)
	at javax.faces.FactoryFinder.getFactory(FactoryFinder.java:277)
	at javax.faces.context.FacesContext.getCurrentInstance(FacesContext.java:912)
(40 more lines...)
Collapse Failed FacesFlowBuilderServicesBeanDefinitionParserTests testEnableManagedBeans History
< 1 sec
java.lang.AssertionError: java.lang.AssertionError
java.lang.AssertionError
	at javax.faces.CurrentThreadToServletContext$FactoryManagerCacheKey.initFromFactoryMap(CurrentThreadToServletContext.java:278)
	at javax.faces.CurrentThreadToServletContext$FactoryManagerCacheKey.<init>(CurrentThreadToServletContext.java:256)
	at javax.faces.CurrentThreadToServletContext.getApplicationFactoryManager(CurrentThreadToServletContext.java:104)
	at javax.faces.CurrentThreadToServletContext.getApplicationFactoryManager(CurrentThreadToServletContext.java:97)
	at javax.faces.FactoryFinder.getFactory(FactoryFinder.java:277)
	at javax.faces.context.FacesContext.getCurrentInstance(FacesContext.java:912)
(40 more lines...)
Collapse Failed FacesFlowBuilderServicesBeanDefinitionParserTests testFlowBuilderServicesAllCustomized History
< 1 sec
java.lang.AssertionError: java.lang.AssertionError
java.lang.AssertionError
	at javax.faces.CurrentThreadToServletContext$FactoryManagerCacheKey.initFromFactoryMap(CurrentThreadToServletContext.java:278)
	at javax.faces.CurrentThreadToServletContext$FactoryManagerCacheKey.<init>(CurrentThreadToServletContext.java:256)
	at javax.faces.CurrentThreadToServletContext.getApplicationFactoryManager(CurrentThreadToServletContext.java:104)
	at javax.faces.CurrentThreadToServletContext.getApplicationFactoryManager(CurrentThreadToServletContext.java:97)
	at javax.faces.FactoryFinder.getFactory(FactoryFinder.java:277)
	at javax.faces.context.FacesContext.getCurrentInstance(FacesContext.java:912)
(40 more lines...)
Collapse Failed FacesFlowBuilderServicesBeanDefinitionParserTests testFlowBuilderServicesConversionServiceCustomized History
< 1 sec
java.lang.AssertionError: java.lang.AssertionError
java.lang.AssertionError
	at javax.faces.CurrentThreadToServletContext$FactoryManagerCacheKey.initFromFactoryMap(CurrentThreadToServletContext.java:278)
	at javax.faces.CurrentThreadToServletContext$FactoryManagerCacheKey.<init>(CurrentThreadToServletContext.java:256)
	at javax.faces.CurrentThreadToServletContext.getApplicationFactoryManager(CurrentThreadToServletContext.java:104)
	at javax.faces.CurrentThreadToServletContext.getApplicationFactoryManager(CurrentThreadToServletContext.java:97)
	at javax.faces.FactoryFinder.getFactory(FactoryFinder.java:277)
	at javax.faces.context.FacesContext.getCurrentInstance(FacesContext.java:912)
(40 more lines...)
Collapse Failed FacesFlowBuilderServicesJavaConfigTests testConfigureDefaults History
< 1 sec
java.lang.AssertionError: java.lang.AssertionError
java.lang.AssertionError
	at javax.faces.CurrentThreadToServletContext$FactoryManagerCacheKey.initFromFactoryMap(CurrentThreadToServletContext.java:278)
	at javax.faces.CurrentThreadToServletContext$FactoryManagerCacheKey.<init>(CurrentThreadToServletContext.java:256)
	at javax.faces.CurrentThreadToServletContext.getApplicationFactoryManager(CurrentThreadToServletContext.java:104)
	at javax.faces.CurrentThreadToServletContext.getApplicationFactoryManager(CurrentThreadToServletContext.java:97)
	at javax.faces.FactoryFinder.getFactory(FactoryFinder.java:277)
	at javax.faces.context.FacesContext.getCurrentInstance(FacesContext.java:912)
(40 more lines...)
Collapse Failed FacesFlowBuilderServicesJavaConfigTests testEnableManagedBeans History
< 1 sec
java.lang.AssertionError: java.lang.AssertionError
java.lang.AssertionError
	at javax.faces.CurrentThreadToServletContext$FactoryManagerCacheKey.initFromFactoryMap(CurrentThreadToServletContext.java:278)
	at javax.faces.CurrentThreadToServletContext$FactoryManagerCacheKey.<init>(CurrentThreadToServletContext.java:256)
	at javax.faces.CurrentThreadToServletContext.getApplicationFactoryManager(CurrentThreadToServletContext.java:104)
	at javax.faces.CurrentThreadToServletContext.getApplicationFactoryManager(CurrentThreadToServletContext.java:97)
	at javax.faces.FactoryFinder.getFactory(FactoryFinder.java:277)
	at javax.faces.context.FacesContext.getCurrentInstance(FacesContext.java:912)
(40 more lines...)
Collapse Failed FacesFlowBuilderServicesJavaConfigTests testFlowBuilderServicesAllCustomized History
< 1 sec
java.lang.AssertionError: java.lang.AssertionError
java.lang.AssertionError
	at javax.faces.CurrentThreadToServletContext$FactoryManagerCacheKey.initFromFactoryMap(CurrentThreadToServletContext.java:278)
	at javax.faces.CurrentThreadToServletContext$FactoryManagerCacheKey.<init>(CurrentThreadToServletContext.java:256)
	at javax.faces.CurrentThreadToServletContext.getApplicationFactoryManager(CurrentThreadToServletContext.java:104)
	at javax.faces.CurrentThreadToServletContext.getApplicationFactoryManager(CurrentThreadToServletContext.java:97)
	at javax.faces.FactoryFinder.getFactory(FactoryFinder.java:277)
	at javax.faces.context.FacesContext.getCurrentInstance(FacesContext.java:912)
(40 more lines...)
Collapse Failed FacesFlowBuilderServicesJavaConfigTests testFlowBuilderServicesConversionServiceCustomized History
< 1 sec
java.lang.AssertionError: java.lang.AssertionError
java.lang.AssertionError
	at javax.faces.CurrentThreadToServletContext$FactoryManagerCacheKey.initFromFactoryMap(CurrentThreadToServletContext.java:278)
	at javax.faces.CurrentThreadToServletContext$FactoryManagerCacheKey.<init>(CurrentThreadToServletContext.java:256)
	at javax.faces.CurrentThreadToServletContext.getApplicationFactoryManager(CurrentThreadToServletContext.java:104)
	at javax.faces.CurrentThreadToServletContext.getApplicationFactoryManager(CurrentThreadToServletContext.java:97)
	at javax.faces.FactoryFinder.getFactory(FactoryFinder.java:277)
	at javax.faces.context.FacesContext.getCurrentInstance(FacesContext.java:912)
(40 more lines...)
Collapse Failed ResourcesBeanDefinitionParserTests testConfigureDefaults History
< 1 sec
java.lang.AssertionError: java.lang.AssertionError
java.lang.AssertionError
	at javax.faces.CurrentThreadToServletContext$FactoryManagerCacheKey.initFromFactoryMap(CurrentThreadToServletContext.java:278)
	at javax.faces.CurrentThreadToServletContext$FactoryManagerCacheKey.<init>(CurrentThreadToServletContext.java:256)
	at javax.faces.CurrentThreadToServletContext.getApplicationFactoryManager(CurrentThreadToServletContext.java:104)
	at javax.faces.CurrentThreadToServletContext.getApplicationFactoryManager(CurrentThreadToServletContext.java:91)
	at javax.faces.FactoryFinder.setFactory(FactoryFinder.java:310)
	at org.springframework.faces.webflow.JSFMockHelper$JSFMock.setUp(JSFMockHelper.java:138)
(39 more lines...)
Collapse Failed ResourcesBeanDefinitionParserTests testConfigurePortlet History
< 1 sec
org.springframework.beans.factory.xml.XmlBeanDefinitionStoreException: org.springframework.beans.factory.xml.XmlBeanDefinitionStoreException: Line 9 in XML document from class path resource [org/springframework/faces/config/resources.xml] is invalid; nested exception is org.xml.sax.SAXParseException; lineNumber: 9; columnNumber: 21; cvc-complex-type.2.4.c: The matching wildcard is strict, but no declaration can be found for element 'faces:resources'.
org.springframework.beans.factory.xml.XmlBeanDefinitionStoreException: Line 9 in XML document from class path resource [org/springframework/faces/config/resources.xml] is invalid; nested exception is org.xml.sax.SAXParseException; lineNumber: 9; columnNumber: 21; cvc-complex-type.2.4.c: The matching wildcard is strict, but no declaration can be found for element 'faces:resources'.
	at org.springframework.beans.factory.xml.XmlBeanDefinitionReader.doLoadBeanDefinitions(XmlBeanDefinitionReader.java:399)
	at org.springframework.beans.factory.xml.XmlBeanDefinitionReader.loadBeanDefinitions(XmlBeanDefinitionReader.java:336)
	at org.springframework.beans.factory.xml.XmlBeanDefinitionReader.loadBeanDefinitions(XmlBeanDefinitionReader.java:304)
	at org.springframework.beans.factory.support.AbstractBeanDefinitionReader.loadBeanDefinitions(AbstractBeanDefinitionReader.java:181)
	at org.springframework.beans.factory.support.AbstractBeanDefinitionReader.loadBeanDefinitions(AbstractBeanDefinitionReader.java:217)
	at org.springframework.beans.factory.support.AbstractBeanDefinitionReader.loadBeanDefinitions(AbstractBeanDefinitionReader.java:188)
(72 more lines...)
Collapse Failed SelectionTrackingActionListenerTests testProcessActionWithUIData History
< 1 sec
java.lang.AssertionError: java.lang.AssertionError
java.lang.AssertionError
	at javax.faces.CurrentThreadToServletContext$FactoryManagerCacheKey.initFromFactoryMap(CurrentThreadToServletContext.java:278)
	at javax.faces.CurrentThreadToServletContext$FactoryManagerCacheKey.<init>(CurrentThreadToServletContext.java:256)
	at javax.faces.CurrentThreadToServletContext.getApplicationFactoryManager(CurrentThreadToServletContext.java:104)
	at javax.faces.CurrentThreadToServletContext.getApplicationFactoryManager(CurrentThreadToServletContext.java:97)
	at javax.faces.FactoryFinder.getFactory(FactoryFinder.java:277)
	at javax.faces.context.FacesContext.getCurrentInstance(FacesContext.java:912)
(40 more lines...)
Collapse Failed SelectionTrackingActionListenerTests testProcessActionWithUIRepeat History
< 1 sec
java.lang.AssertionError: java.lang.AssertionError
java.lang.AssertionError
	at javax.faces.CurrentThreadToServletContext$FactoryManagerCacheKey.initFromFactoryMap(CurrentThreadToServletContext.java:278)
	at javax.faces.CurrentThreadToServletContext$FactoryManagerCacheKey.<init>(CurrentThreadToServletContext.java:256)
	at javax.faces.CurrentThreadToServletContext.getApplicationFactoryManager(CurrentThreadToServletContext.java:104)
	at javax.faces.CurrentThreadToServletContext.getApplicationFactoryManager(CurrentThreadToServletContext.java:97)
	at javax.faces.FactoryFinder.getFactory(FactoryFinder.java:277)
	at javax.faces.context.FacesContext.getCurrentInstance(FacesContext.java:912)
(40 more lines...)
Collapse Failed JsfViewTests testViewRender History
< 1 sec
java.lang.AssertionError: java.lang.AssertionError
java.lang.AssertionError
	at javax.faces.CurrentThreadToServletContext$FactoryManagerCacheKey.initFromFactoryMap(CurrentThreadToServletContext.java:278)
	at javax.faces.CurrentThreadToServletContext$FactoryManagerCacheKey.<init>(CurrentThreadToServletContext.java:256)
	at javax.faces.CurrentThreadToServletContext.getApplicationFactoryManager(CurrentThreadToServletContext.java:104)
	at javax.faces.CurrentThreadToServletContext.getApplicationFactoryManager(CurrentThreadToServletContext.java:97)
	at javax.faces.FactoryFinder.getFactory(FactoryFinder.java:277)
	at javax.faces.context.FacesContext.getCurrentInstance(FacesContext.java:912)
(40 more lines...)
Collapse Failed JsfViewTests testViewResolution History
< 1 sec
java.lang.AssertionError: java.lang.AssertionError
java.lang.AssertionError
	at javax.faces.CurrentThreadToServletContext$FactoryManagerCacheKey.initFromFactoryMap(CurrentThreadToServletContext.java:278)
	at javax.faces.CurrentThreadToServletContext$FactoryManagerCacheKey.<init>(CurrentThreadToServletContext.java:256)
	at javax.faces.CurrentThreadToServletContext.getApplicationFactoryManager(CurrentThreadToServletContext.java:104)
	at javax.faces.CurrentThreadToServletContext.getApplicationFactoryManager(CurrentThreadToServletContext.java:97)
	at javax.faces.FactoryFinder.getFactory(FactoryFinder.java:277)
	at javax.faces.context.FacesContext.getCurrentInstance(FacesContext.java:912)
(40 more lines...)
Collapse Failed FlowActionListenerTests testProcessAction History
< 1 sec
java.lang.AssertionError: java.lang.AssertionError
java.lang.AssertionError
	at javax.faces.CurrentThreadToServletContext$FactoryManagerCacheKey.initFromFactoryMap(CurrentThreadToServletContext.java:278)
	at javax.faces.CurrentThreadToServletContext$FactoryManagerCacheKey.<init>(CurrentThreadToServletContext.java:256)
	at javax.faces.CurrentThreadToServletContext.getApplicationFactoryManager(CurrentThreadToServletContext.java:104)
	at javax.faces.CurrentThreadToServletContext.getApplicationFactoryManager(CurrentThreadToServletContext.java:97)
	at javax.faces.FactoryFinder.getFactory(FactoryFinder.java:277)
	at javax.faces.context.FacesContext.getCurrentInstance(FacesContext.java:912)
(40 more lines...)
Collapse Failed FlowActionListenerTests testProcessAction_NullOutcome History
< 1 sec
java.lang.AssertionError: java.lang.AssertionError
java.lang.AssertionError
	at javax.faces.CurrentThreadToServletContext$FactoryManagerCacheKey.initFromFactoryMap(CurrentThreadToServletContext.java:278)
	at javax.faces.CurrentThreadToServletContext$FactoryManagerCacheKey.<init>(CurrentThreadToServletContext.java:256)
	at javax.faces.CurrentThreadToServletContext.getApplicationFactoryManager(CurrentThreadToServletContext.java:104)
	at javax.faces.CurrentThreadToServletContext.getApplicationFactoryManager(CurrentThreadToServletContext.java:97)
	at javax.faces.FactoryFinder.getFactory(FactoryFinder.java:277)
	at javax.faces.context.FacesContext.getCurrentInstance(FacesContext.java:912)
(40 more lines...)
Collapse Failed FlowFacesContextTests testAddMessage History
< 1 sec
java.lang.AssertionError: java.lang.AssertionError
java.lang.AssertionError
	at javax.faces.CurrentThreadToServletContext$FactoryManagerCacheKey.initFromFactoryMap(CurrentThreadToServletContext.java:278)
	at javax.faces.CurrentThreadToServletContext$FactoryManagerCacheKey.<init>(CurrentThreadToServletContext.java:256)
	at javax.faces.CurrentThreadToServletContext.getApplicationFactoryManager(CurrentThreadToServletContext.java:104)
	at javax.faces.CurrentThreadToServletContext.getApplicationFactoryManager(CurrentThreadToServletContext.java:97)
	at javax.faces.FactoryFinder.getFactory(FactoryFinder.java:277)
	at javax.faces.context.FacesContext.getCurrentInstance(FacesContext.java:912)
(40 more lines...)
Collapse Failed FlowFacesContextTests testAddMessages_MultipleNullIds History
< 1 sec
java.lang.AssertionError: java.lang.AssertionError
java.lang.AssertionError
	at javax.faces.CurrentThreadToServletContext$FactoryManagerCacheKey.initFromFactoryMap(CurrentThreadToServletContext.java:278)
	at javax.faces.CurrentThreadToServletContext$FactoryManagerCacheKey.<init>(CurrentThreadToServletContext.java:256)
	at javax.faces.CurrentThreadToServletContext.getApplicationFactoryManager(CurrentThreadToServletContext.java:104)
	at javax.faces.CurrentThreadToServletContext.getApplicationFactoryManager(CurrentThreadToServletContext.java:97)
	at javax.faces.FactoryFinder.getFactory(FactoryFinder.java:277)
	at javax.faces.context.FacesContext.getCurrentInstance(FacesContext.java:912)
(40 more lines...)
Collapse Failed FlowFacesContextTests testCurrentInstance History
< 1 sec
java.lang.AssertionError: java.lang.AssertionError
java.lang.AssertionError
	at javax.faces.CurrentThreadToServletContext$FactoryManagerCacheKey.initFromFactoryMap(CurrentThreadToServletContext.java:278)
	at javax.faces.CurrentThreadToServletContext$FactoryManagerCacheKey.<init>(CurrentThreadToServletContext.java:256)
	at javax.faces.CurrentThreadToServletContext.getApplicationFactoryManager(CurrentThreadToServletContext.java:104)
	at javax.faces.CurrentThreadToServletContext.getApplicationFactoryManager(CurrentThreadToServletContext.java:97)
	at javax.faces.FactoryFinder.getFactory(FactoryFinder.java:277)
	at javax.faces.context.FacesContext.getCurrentInstance(FacesContext.java:912)
(40 more lines...)
Collapse Failed FlowFacesContextTests testGetAllMessages History
< 1 sec
java.lang.AssertionError: java.lang.AssertionError
java.lang.AssertionError
	at javax.faces.CurrentThreadToServletContext$FactoryManagerCacheKey.initFromFactoryMap(CurrentThreadToServletContext.java:278)
	at javax.faces.CurrentThreadToServletContext$FactoryManagerCacheKey.<init>(CurrentThreadToServletContext.java:256)
	at javax.faces.CurrentThreadToServletContext.getApplicationFactoryManager(CurrentThreadToServletContext.java:104)
	at javax.faces.CurrentThreadToServletContext.getApplicationFactoryManager(CurrentThreadToServletContext.java:97)
	at javax.faces.FactoryFinder.getFactory(FactoryFinder.java:277)
	at javax.faces.context.FacesContext.getCurrentInstance(FacesContext.java:912)
(40 more lines...)
Collapse Failed FlowFacesContextTests testGetClientIdsWithMessages History
< 1 sec
java.lang.AssertionError: java.lang.AssertionError
java.lang.AssertionError
	at javax.faces.CurrentThreadToServletContext$FactoryManagerCacheKey.initFromFactoryMap(CurrentThreadToServletContext.java:278)
	at javax.faces.CurrentThreadToServletContext$FactoryManagerCacheKey.<init>(CurrentThreadToServletContext.java:256)
	at javax.faces.CurrentThreadToServletContext.getApplicationFactoryManager(CurrentThreadToServletContext.java:104)
	at javax.faces.CurrentThreadToServletContext.getApplicationFactoryManager(CurrentThreadToServletContext.java:97)
	at javax.faces.FactoryFinder.getFactory(FactoryFinder.java:277)
	at javax.faces.context.FacesContext.getCurrentInstance(FacesContext.java:912)
(40 more lines...)
Collapse Failed FlowFacesContextTests testGetELContext History
< 1 sec
java.lang.AssertionError: java.lang.AssertionError
java.lang.AssertionError
	at javax.faces.CurrentThreadToServletContext$FactoryManagerCacheKey.initFromFactoryMap(CurrentThreadToServletContext.java:278)
	at javax.faces.CurrentThreadToServletContext$FactoryManagerCacheKey.<init>(CurrentThreadToServletContext.java:256)
	at javax.faces.CurrentThreadToServletContext.getApplicationFactoryManager(CurrentThreadToServletContext.java:104)
	at javax.faces.CurrentThreadToServletContext.getApplicationFactoryManager(CurrentThreadToServletContext.java:97)
	at javax.faces.FactoryFinder.getFactory(FactoryFinder.java:277)
	at javax.faces.context.FacesContext.getCurrentInstance(FacesContext.java:912)
(40 more lines...)
Collapse Failed FlowFacesContextTests testGetGlobalMessagesOnly History
< 1 sec
java.lang.AssertionError: java.lang.AssertionError
java.lang.AssertionError
	at javax.faces.CurrentThreadToServletContext$FactoryManagerCacheKey.initFromFactoryMap(CurrentThreadToServletContext.java:278)
	at javax.faces.CurrentThreadToServletContext$FactoryManagerCacheKey.<init>(CurrentThreadToServletContext.java:256)
	at javax.faces.CurrentThreadToServletContext.getApplicationFactoryManager(CurrentThreadToServletContext.java:104)
	at javax.faces.CurrentThreadToServletContext.getApplicationFactoryManager(CurrentThreadToServletContext.java:97)
	at javax.faces.FactoryFinder.getFactory(FactoryFinder.java:277)
	at javax.faces.context.FacesContext.getCurrentInstance(FacesContext.java:912)
(40 more lines...)
Collapse Failed FlowFacesContextTests testGetMaximumSeverity History
< 1 sec
java.lang.AssertionError: java.lang.AssertionError
java.lang.AssertionError
	at javax.faces.CurrentThreadToServletContext$FactoryManagerCacheKey.initFromFactoryMap(CurrentThreadToServletContext.java:278)
	at javax.faces.CurrentThreadToServletContext$FactoryManagerCacheKey.<init>(CurrentThreadToServletContext.java:256)
	at javax.faces.CurrentThreadToServletContext.getApplicationFactoryManager(CurrentThreadToServletContext.java:104)
	at javax.faces.CurrentThreadToServletContext.getApplicationFactoryManager(CurrentThreadToServletContext.java:97)
	at javax.faces.FactoryFinder.getFactory(FactoryFinder.java:277)
	at javax.faces.context.FacesContext.getCurrentInstance(FacesContext.java:912)
(40 more lines...)
Collapse Failed FlowFacesContextTests testGetMessages History
< 1 sec
java.lang.AssertionError: java.lang.AssertionError
java.lang.AssertionError
	at javax.faces.CurrentThreadToServletContext$FactoryManagerCacheKey.initFromFactoryMap(CurrentThreadToServletContext.java:278)
	at javax.faces.CurrentThreadToServletContext$FactoryManagerCacheKey.<init>(CurrentThreadToServletContext.java:256)
	at javax.faces.CurrentThreadToServletContext.getApplicationFactoryManager(CurrentThreadToServletContext.java:104)
	at javax.faces.CurrentThreadToServletContext.getApplicationFactoryManager(CurrentThreadToServletContext.java:97)
	at javax.faces.FactoryFinder.getFactory(FactoryFinder.java:277)
	at javax.faces.context.FacesContext.getCurrentInstance(FacesContext.java:912)
(40 more lines...)
Collapse Failed FlowFacesContextTests testGetMessagesByClientId_ForComponent History
< 1 sec
java.lang.AssertionError: java.lang.AssertionError
java.lang.AssertionError
	at javax.faces.CurrentThreadToServletContext$FactoryManagerCacheKey.initFromFactoryMap(CurrentThreadToServletContext.java:278)
	at javax.faces.CurrentThreadToServletContext$FactoryManagerCacheKey.<init>(CurrentThreadToServletContext.java:256)
	at javax.faces.CurrentThreadToServletContext.getApplicationFactoryManager(CurrentThreadToServletContext.java:104)
	at javax.faces.CurrentThreadToServletContext.getApplicationFactoryManager(CurrentThreadToServletContext.java:97)
	at javax.faces.FactoryFinder.getFactory(FactoryFinder.java:277)
	at javax.faces.context.FacesContext.getCurrentInstance(FacesContext.java:912)
(40 more lines...)
Collapse Failed FlowFacesContextTests testGetMessagesByClientId_ForUserMessage History
< 1 sec
java.lang.AssertionError: java.lang.AssertionError
java.lang.AssertionError
	at javax.faces.CurrentThreadToServletContext$FactoryManagerCacheKey.initFromFactoryMap(CurrentThreadToServletContext.java:278)
	at javax.faces.CurrentThreadToServletContext$FactoryManagerCacheKey.<init>(CurrentThreadToServletContext.java:256)
	at javax.faces.CurrentThreadToServletContext.getApplicationFactoryManager(CurrentThreadToServletContext.java:104)
	at javax.faces.CurrentThreadToServletContext.getApplicationFactoryManager(CurrentThreadToServletContext.java:97)
	at javax.faces.FactoryFinder.getFactory(FactoryFinder.java:277)
	at javax.faces.context.FacesContext.getCurrentInstance(FacesContext.java:912)
(40 more lines...)
Collapse Failed FlowFacesContextTests testMessagesAreSerializable History
< 1 sec
java.lang.AssertionError: java.lang.AssertionError
java.lang.AssertionError
	at javax.faces.CurrentThreadToServletContext$FactoryManagerCacheKey.initFromFactoryMap(CurrentThreadToServletContext.java:278)
	at javax.faces.CurrentThreadToServletContext$FactoryManagerCacheKey.<init>(CurrentThreadToServletContext.java:256)
	at javax.faces.CurrentThreadToServletContext.getApplicationFactoryManager(CurrentThreadToServletContext.java:104)
	at javax.faces.CurrentThreadToServletContext.getApplicationFactoryManager(CurrentThreadToServletContext.java:97)
	at javax.faces.FactoryFinder.getFactory(FactoryFinder.java:277)
	at javax.faces.context.FacesContext.getCurrentInstance(FacesContext.java:912)
(40 more lines...)
Collapse Failed FlowFacesContextTests testMutableGetMessages History
< 1 sec
java.lang.AssertionError: java.lang.AssertionError
java.lang.AssertionError
	at javax.faces.CurrentThreadToServletContext$FactoryManagerCacheKey.initFromFactoryMap(CurrentThreadToServletContext.java:278)
	at javax.faces.CurrentThreadToServletContext$FactoryManagerCacheKey.<init>(CurrentThreadToServletContext.java:256)
	at javax.faces.CurrentThreadToServletContext.getApplicationFactoryManager(CurrentThreadToServletContext.java:104)
	at javax.faces.CurrentThreadToServletContext.getApplicationFactoryManager(CurrentThreadToServletContext.java:97)
	at javax.faces.FactoryFinder.getFactory(FactoryFinder.java:277)
	at javax.faces.context.FacesContext.getCurrentInstance(FacesContext.java:912)
(40 more lines...)
Collapse Failed FlowFacesContextTests testValidationFailed History
< 1 sec
java.lang.AssertionError: java.lang.AssertionError
java.lang.AssertionError
	at javax.faces.CurrentThreadToServletContext$FactoryManagerCacheKey.initFromFactoryMap(CurrentThreadToServletContext.java:278)
	at javax.faces.CurrentThreadToServletContext$FactoryManagerCacheKey.<init>(CurrentThreadToServletContext.java:256)
	at javax.faces.CurrentThreadToServletContext.getApplicationFactoryManager(CurrentThreadToServletContext.java:104)
	at javax.faces.CurrentThreadToServletContext.getApplicationFactoryManager(CurrentThreadToServletContext.java:97)
	at javax.faces.FactoryFinder.getFactory(FactoryFinder.java:277)
	at javax.faces.context.FacesContext.getCurrentInstance(FacesContext.java:912)
(40 more lines...)
Collapse Failed FlowFacesContextTests testgetMessagesByClientId_InvalidId History
< 1 sec
java.lang.AssertionError: java.lang.AssertionError
java.lang.AssertionError
	at javax.faces.CurrentThreadToServletContext$FactoryManagerCacheKey.initFromFactoryMap(CurrentThreadToServletContext.java:278)
	at javax.faces.CurrentThreadToServletContext$FactoryManagerCacheKey.<init>(CurrentThreadToServletContext.java:256)
	at javax.faces.CurrentThreadToServletContext.getApplicationFactoryManager(CurrentThreadToServletContext.java:104)
	at javax.faces.CurrentThreadToServletContext.getApplicationFactoryManager(CurrentThreadToServletContext.java:97)
	at javax.faces.FactoryFinder.getFactory(FactoryFinder.java:277)
	at javax.faces.context.FacesContext.getCurrentInstance(FacesContext.java:912)
(40 more lines...)
Collapse Failed FlowResponseStateManagerTests testGetState History
< 1 sec
java.lang.AssertionError: java.lang.AssertionError
java.lang.AssertionError
	at javax.faces.CurrentThreadToServletContext$FactoryManagerCacheKey.initFromFactoryMap(CurrentThreadToServletContext.java:278)
	at javax.faces.CurrentThreadToServletContext$FactoryManagerCacheKey.<init>(CurrentThreadToServletContext.java:256)
	at javax.faces.CurrentThreadToServletContext.getApplicationFactoryManager(CurrentThreadToServletContext.java:104)
	at javax.faces.CurrentThreadToServletContext.getApplicationFactoryManager(CurrentThreadToServletContext.java:97)
	at javax.faces.FactoryFinder.getFactory(FactoryFinder.java:277)
	at javax.faces.context.FacesContext.getCurrentInstance(FacesContext.java:912)
(40 more lines...)
Collapse Failed FlowResponseStateManagerTests testWriteFlowSerializedView History
< 1 sec
java.lang.AssertionError: java.lang.AssertionError
java.lang.AssertionError
	at javax.faces.CurrentThreadToServletContext$FactoryManagerCacheKey.initFromFactoryMap(CurrentThreadToServletContext.java:278)
	at javax.faces.CurrentThreadToServletContext$FactoryManagerCacheKey.<init>(CurrentThreadToServletContext.java:256)
	at javax.faces.CurrentThreadToServletContext.getApplicationFactoryManager(CurrentThreadToServletContext.java:104)
	at javax.faces.CurrentThreadToServletContext.getApplicationFactoryManager(CurrentThreadToServletContext.java:97)
	at javax.faces.FactoryFinder.getFactory(FactoryFinder.java:277)
	at javax.faces.context.FacesContext.getCurrentInstance(FacesContext.java:912)
(40 more lines...)
Collapse Failed FlowResponseStateManagerTests testname History
< 1 sec
java.lang.AssertionError: java.lang.AssertionError
java.lang.AssertionError
	at javax.faces.CurrentThreadToServletContext$FactoryManagerCacheKey.initFromFactoryMap(CurrentThreadToServletContext.java:278)
	at javax.faces.CurrentThreadToServletContext$FactoryManagerCacheKey.<init>(CurrentThreadToServletContext.java:256)
	at javax.faces.CurrentThreadToServletContext.getApplicationFactoryManager(CurrentThreadToServletContext.java:104)
	at javax.faces.CurrentThreadToServletContext.getApplicationFactoryManager(CurrentThreadToServletContext.java:97)
	at javax.faces.FactoryFinder.getFactory(FactoryFinder.java:277)
	at javax.faces.context.FacesContext.getCurrentInstance(FacesContext.java:912)
(40 more lines...)
Collapse Failed JsfAjaxHandlerTests testSendAjaxRedirect History
< 1 sec
java.lang.AssertionError: java.lang.AssertionError
java.lang.AssertionError
	at javax.faces.CurrentThreadToServletContext$FactoryManagerCacheKey.initFromFactoryMap(CurrentThreadToServletContext.java:278)
	at javax.faces.CurrentThreadToServletContext$FactoryManagerCacheKey.<init>(CurrentThreadToServletContext.java:256)
	at javax.faces.CurrentThreadToServletContext.getApplicationFactoryManager(CurrentThreadToServletContext.java:104)
	at javax.faces.CurrentThreadToServletContext.getApplicationFactoryManager(CurrentThreadToServletContext.java:97)
	at javax.faces.FactoryFinder.getFactory(FactoryFinder.java:277)
	at javax.faces.context.FacesContext.getCurrentInstance(FacesContext.java:912)
(38 more lines...)
Collapse Failed JsfFinalResponseActionTests testRender History
< 1 sec
java.lang.AssertionError: java.lang.AssertionError
java.lang.AssertionError
	at javax.faces.CurrentThreadToServletContext$FactoryManagerCacheKey.initFromFactoryMap(CurrentThreadToServletContext.java:278)
	at javax.faces.CurrentThreadToServletContext$FactoryManagerCacheKey.<init>(CurrentThreadToServletContext.java:256)
	at javax.faces.CurrentThreadToServletContext.getApplicationFactoryManager(CurrentThreadToServletContext.java:104)
	at javax.faces.CurrentThreadToServletContext.getApplicationFactoryManager(CurrentThreadToServletContext.java:97)
	at javax.faces.FactoryFinder.getFactory(FactoryFinder.java:277)
	at javax.faces.context.FacesContext.getCurrentInstance(FacesContext.java:912)
(39 more lines...)
Collapse Failed JsfManagedBeanAwareELExpressionParserTests testGetJSFBean History
< 1 sec
java.lang.AssertionError: java.lang.AssertionError
java.lang.AssertionError
	at javax.faces.CurrentThreadToServletContext$FactoryManagerCacheKey.initFromFactoryMap(CurrentThreadToServletContext.java:278)
	at javax.faces.CurrentThreadToServletContext$FactoryManagerCacheKey.<init>(CurrentThreadToServletContext.java:256)
	at javax.faces.CurrentThreadToServletContext.getApplicationFactoryManager(CurrentThreadToServletContext.java:104)
	at javax.faces.CurrentThreadToServletContext.getApplicationFactoryManager(CurrentThreadToServletContext.java:97)
	at javax.faces.FactoryFinder.getFactory(FactoryFinder.java:277)
	at javax.faces.context.FacesContext.getCurrentInstance(FacesContext.java:912)
(40 more lines...)
Collapse Failed JsfManagedBeanPropertyAccessorTests testCanRead History
< 1 sec
java.lang.AssertionError: java.lang.AssertionError
java.lang.AssertionError
	at javax.faces.CurrentThreadToServletContext$FactoryManagerCacheKey.initFromFactoryMap(CurrentThreadToServletContext.java:278)
	at javax.faces.CurrentThreadToServletContext$FactoryManagerCacheKey.<init>(CurrentThreadToServletContext.java:256)
	at javax.faces.CurrentThreadToServletContext.getApplicationFactoryManager(CurrentThreadToServletContext.java:104)
	at javax.faces.CurrentThreadToServletContext.getApplicationFactoryManager(CurrentThreadToServletContext.java:97)
	at javax.faces.FactoryFinder.getFactory(FactoryFinder.java:277)
	at javax.faces.context.FacesContext.getCurrentInstance(FacesContext.java:912)
(38 more lines...)
Collapse Failed JsfManagedBeanPropertyAccessorTests testCanWrite History
< 1 sec
java.lang.AssertionError: java.lang.AssertionError
java.lang.AssertionError
	at javax.faces.CurrentThreadToServletContext$FactoryManagerCacheKey.initFromFactoryMap(CurrentThreadToServletContext.java:278)
	at javax.faces.CurrentThreadToServletContext$FactoryManagerCacheKey.<init>(CurrentThreadToServletContext.java:256)
	at javax.faces.CurrentThreadToServletContext.getApplicationFactoryManager(CurrentThreadToServletContext.java:104)
	at javax.faces.CurrentThreadToServletContext.getApplicationFactoryManager(CurrentThreadToServletContext.java:97)
	at javax.faces.FactoryFinder.getFactory(FactoryFinder.java:277)
	at javax.faces.context.FacesContext.getCurrentInstance(FacesContext.java:912)
(38 more lines...)
Collapse Failed JsfManagedBeanPropertyAccessorTests testRead History
< 1 sec
java.lang.AssertionError: java.lang.AssertionError
java.lang.AssertionError
	at javax.faces.CurrentThreadToServletContext$FactoryManagerCacheKey.initFromFactoryMap(CurrentThreadToServletContext.java:278)
	at javax.faces.CurrentThreadToServletContext$FactoryManagerCacheKey.<init>(CurrentThreadToServletContext.java:256)
	at javax.faces.CurrentThreadToServletContext.getApplicationFactoryManager(CurrentThreadToServletContext.java:104)
	at javax.faces.CurrentThreadToServletContext.getApplicationFactoryManager(CurrentThreadToServletContext.java:97)
	at javax.faces.FactoryFinder.getFactory(FactoryFinder.java:277)
	at javax.faces.context.FacesContext.getCurrentInstance(FacesContext.java:912)
(38 more lines...)
Collapse Failed JsfManagedBeanPropertyAccessorTests testWrite History
< 1 sec
java.lang.AssertionError: java.lang.AssertionError
java.lang.AssertionError
	at javax.faces.CurrentThreadToServletContext$FactoryManagerCacheKey.initFromFactoryMap(CurrentThreadToServletContext.java:278)
	at javax.faces.CurrentThreadToServletContext$FactoryManagerCacheKey.<init>(CurrentThreadToServletContext.java:256)
	at javax.faces.CurrentThreadToServletContext.getApplicationFactoryManager(CurrentThreadToServletContext.java:104)
	at javax.faces.CurrentThreadToServletContext.getApplicationFactoryManager(CurrentThreadToServletContext.java:97)
	at javax.faces.FactoryFinder.getFactory(FactoryFinder.java:277)
	at javax.faces.context.FacesContext.getCurrentInstance(FacesContext.java:912)
(38 more lines...)
Collapse Failed JsfUtilsTests testAfterListenersCalledInReverseOrder History
< 1 sec
java.lang.AssertionError: java.lang.AssertionError
java.lang.AssertionError
	at javax.faces.CurrentThreadToServletContext$FactoryManagerCacheKey.initFromFactoryMap(CurrentThreadToServletContext.java:278)
	at javax.faces.CurrentThreadToServletContext$FactoryManagerCacheKey.<init>(CurrentThreadToServletContext.java:256)
	at javax.faces.CurrentThreadToServletContext.getApplicationFactoryManager(CurrentThreadToServletContext.java:104)
	at javax.faces.CurrentThreadToServletContext.getApplicationFactoryManager(CurrentThreadToServletContext.java:91)
	at javax.faces.FactoryFinder.releaseFactories(FactoryFinder.java:332)
	at org.apache.myfaces.test.base.AbstractJsfTestCase.setUp(AbstractJsfTestCase.java:106)
(35 more lines...)
Collapse Failed JsfUtilsTests testBeforeListenersCalledInForwardOrder History
< 1 sec
java.lang.AssertionError: java.lang.AssertionError
java.lang.AssertionError
	at javax.faces.CurrentThreadToServletContext$FactoryManagerCacheKey.initFromFactoryMap(CurrentThreadToServletContext.java:278)
	at javax.faces.CurrentThreadToServletContext$FactoryManagerCacheKey.<init>(CurrentThreadToServletContext.java:256)
	at javax.faces.CurrentThreadToServletContext.getApplicationFactoryManager(CurrentThreadToServletContext.java:104)
	at javax.faces.CurrentThreadToServletContext.getApplicationFactoryManager(CurrentThreadToServletContext.java:91)
	at javax.faces.FactoryFinder.releaseFactories(FactoryFinder.java:332)
	at org.apache.myfaces.test.base.AbstractJsfTestCase.setUp(AbstractJsfTestCase.java:106)
(35 more lines...)
Collapse Failed JsfUtilsTests testGetFactory History
< 1 sec
java.lang.AssertionError: java.lang.AssertionError
java.lang.AssertionError
	at javax.faces.CurrentThreadToServletContext$FactoryManagerCacheKey.initFromFactoryMap(CurrentThreadToServletContext.java:278)
	at javax.faces.CurrentThreadToServletContext$FactoryManagerCacheKey.<init>(CurrentThreadToServletContext.java:256)
	at javax.faces.CurrentThreadToServletContext.getApplicationFactoryManager(CurrentThreadToServletContext.java:104)
	at javax.faces.CurrentThreadToServletContext.getApplicationFactoryManager(CurrentThreadToServletContext.java:91)
	at javax.faces.FactoryFinder.releaseFactories(FactoryFinder.java:332)
	at org.apache.myfaces.test.base.AbstractJsfTestCase.setUp(AbstractJsfTestCase.java:106)
(35 more lines...)
Collapse Failed JsfUtilsTests testGetUnknowFactory History
< 1 sec
java.lang.AssertionError: java.lang.AssertionError
java.lang.AssertionError
	at javax.faces.CurrentThreadToServletContext$FactoryManagerCacheKey.initFromFactoryMap(CurrentThreadToServletContext.java:278)
	at javax.faces.CurrentThreadToServletContext$FactoryManagerCacheKey.<init>(CurrentThreadToServletContext.java:256)
	at javax.faces.CurrentThreadToServletContext.getApplicationFactoryManager(CurrentThreadToServletContext.java:104)
	at javax.faces.CurrentThreadToServletContext.getApplicationFactoryManager(CurrentThreadToServletContext.java:91)
	at javax.faces.FactoryFinder.releaseFactories(FactoryFinder.java:332)
	at org.apache.myfaces.test.base.AbstractJsfTestCase.setUp(AbstractJsfTestCase.java:106)
(35 more lines...)
Collapse Failed JsfViewFactoryTests testGetView_Create History
< 1 sec
java.lang.AssertionError: java.lang.AssertionError
java.lang.AssertionError
	at javax.faces.CurrentThreadToServletContext$FactoryManagerCacheKey.initFromFactoryMap(CurrentThreadToServletContext.java:278)
	at javax.faces.CurrentThreadToServletContext$FactoryManagerCacheKey.<init>(CurrentThreadToServletContext.java:256)
	at javax.faces.CurrentThreadToServletContext.getApplicationFactoryManager(CurrentThreadToServletContext.java:104)
	at javax.faces.CurrentThreadToServletContext.getApplicationFactoryManager(CurrentThreadToServletContext.java:97)
	at javax.faces.FactoryFinder.getFactory(FactoryFinder.java:277)
	at javax.faces.context.FacesContext.getCurrentInstance(FacesContext.java:912)
(39 more lines...)
Collapse Failed JsfViewFactoryTests testGetView_ExceptionsOnPostRestoreStateEvent History
< 1 sec
java.lang.AssertionError: java.lang.AssertionError
java.lang.AssertionError
	at javax.faces.CurrentThreadToServletContext$FactoryManagerCacheKey.initFromFactoryMap(CurrentThreadToServletContext.java:278)
	at javax.faces.CurrentThreadToServletContext$FactoryManagerCacheKey.<init>(CurrentThreadToServletContext.java:256)
	at javax.faces.CurrentThreadToServletContext.getApplicationFactoryManager(CurrentThreadToServletContext.java:104)
	at javax.faces.CurrentThreadToServletContext.getApplicationFactoryManager(CurrentThreadToServletContext.java:97)
	at javax.faces.FactoryFinder.getFactory(FactoryFinder.java:277)
	at javax.faces.context.FacesContext.getCurrentInstance(FacesContext.java:912)
(39 more lines...)
Collapse Failed JsfViewFactoryTests testGetView_ExternalViewRoot History
< 1 sec
java.lang.AssertionError: java.lang.AssertionError
java.lang.AssertionError
	at javax.faces.CurrentThreadToServletContext$FactoryManagerCacheKey.initFromFactoryMap(CurrentThreadToServletContext.java:278)
	at javax.faces.CurrentThreadToServletContext$FactoryManagerCacheKey.<init>(CurrentThreadToServletContext.java:256)
	at javax.faces.CurrentThreadToServletContext.getApplicationFactoryManager(CurrentThreadToServletContext.java:104)
	at javax.faces.CurrentThreadToServletContext.getApplicationFactoryManager(CurrentThreadToServletContext.java:97)
	at javax.faces.FactoryFinder.getFactory(FactoryFinder.java:277)
	at javax.faces.context.FacesContext.getCurrentInstance(FacesContext.java:912)
(39 more lines...)
Collapse Failed JsfViewFactoryTests testGetView_Restore History
< 1 sec
java.lang.AssertionError: java.lang.AssertionError
java.lang.AssertionError
	at javax.faces.CurrentThreadToServletContext$FactoryManagerCacheKey.initFromFactoryMap(CurrentThreadToServletContext.java:278)
	at javax.faces.CurrentThreadToServletContext$FactoryManagerCacheKey.<init>(CurrentThreadToServletContext.java:256)
	at javax.faces.CurrentThreadToServletContext.getApplicationFactoryManager(CurrentThreadToServletContext.java:104)
	at javax.faces.CurrentThreadToServletContext.getApplicationFactoryManager(CurrentThreadToServletContext.java:97)
	at javax.faces.FactoryFinder.getFactory(FactoryFinder.java:277)
	at javax.faces.context.FacesContext.getCurrentInstance(FacesContext.java:912)
(39 more lines...)
Collapse Failed JsfViewFactoryTests testGetView_RestoreWithBindings History
< 1 sec
java.lang.AssertionError: java.lang.AssertionError
java.lang.AssertionError
	at javax.faces.CurrentThreadToServletContext$FactoryManagerCacheKey.initFromFactoryMap(CurrentThreadToServletContext.java:278)
	at javax.faces.CurrentThreadToServletContext$FactoryManagerCacheKey.<init>(CurrentThreadToServletContext.java:256)
	at javax.faces.CurrentThreadToServletContext.getApplicationFactoryManager(CurrentThreadToServletContext.java:104)
	at javax.faces.CurrentThreadToServletContext.getApplicationFactoryManager(CurrentThreadToServletContext.java:97)
	at javax.faces.FactoryFinder.getFactory(FactoryFinder.java:277)
	at javax.faces.context.FacesContext.getCurrentInstance(FacesContext.java:912)
(39 more lines...)
Collapse Failed JsfViewFactoryTests testGetView_Restore_Ajax History
< 1 sec
java.lang.AssertionError: java.lang.AssertionError
java.lang.AssertionError
	at javax.faces.CurrentThreadToServletContext$FactoryManagerCacheKey.initFromFactoryMap(CurrentThreadToServletContext.java:278)
	at javax.faces.CurrentThreadToServletContext$FactoryManagerCacheKey.<init>(CurrentThreadToServletContext.java:256)
	at javax.faces.CurrentThreadToServletContext.getApplicationFactoryManager(CurrentThreadToServletContext.java:104)
	at javax.faces.CurrentThreadToServletContext.getApplicationFactoryManager(CurrentThreadToServletContext.java:97)
	at javax.faces.FactoryFinder.getFactory(FactoryFinder.java:277)
	at javax.faces.context.FacesContext.getCurrentInstance(FacesContext.java:912)
(39 more lines...)
Collapse Failed JsfViewTests testProcessUserEvent_Restored_EventSignaled History
< 1 sec
java.lang.AssertionError: java.lang.AssertionError
java.lang.AssertionError
	at javax.faces.CurrentThreadToServletContext$FactoryManagerCacheKey.initFromFactoryMap(CurrentThreadToServletContext.java:278)
	at javax.faces.CurrentThreadToServletContext$FactoryManagerCacheKey.<init>(CurrentThreadToServletContext.java:256)
	at javax.faces.CurrentThreadToServletContext.getApplicationFactoryManager(CurrentThreadToServletContext.java:104)
	at javax.faces.CurrentThreadToServletContext.getApplicationFactoryManager(CurrentThreadToServletContext.java:97)
	at javax.faces.FactoryFinder.getFactory(FactoryFinder.java:277)
	at javax.faces.context.FacesContext.getCurrentInstance(FacesContext.java:912)
(38 more lines...)
Collapse Failed JsfViewTests testProcessUserEvent_Restored_NoEvent History
< 1 sec
java.lang.AssertionError: java.lang.AssertionError
java.lang.AssertionError
	at javax.faces.CurrentThreadToServletContext$FactoryManagerCacheKey.initFromFactoryMap(CurrentThreadToServletContext.java:278)
	at javax.faces.CurrentThreadToServletContext$FactoryManagerCacheKey.<init>(CurrentThreadToServletContext.java:256)
	at javax.faces.CurrentThreadToServletContext.getApplicationFactoryManager(CurrentThreadToServletContext.java:104)
	at javax.faces.CurrentThreadToServletContext.getApplicationFactoryManager(CurrentThreadToServletContext.java:97)
	at javax.faces.FactoryFinder.getFactory(FactoryFinder.java:277)
	at javax.faces.context.FacesContext.getCurrentInstance(FacesContext.java:912)
(38 more lines...)
Collapse Failed JsfViewTests testRender History
< 1 sec
java.lang.AssertionError: java.lang.AssertionError
java.lang.AssertionError
	at javax.faces.CurrentThreadToServletContext$FactoryManagerCacheKey.initFromFactoryMap(CurrentThreadToServletContext.java:278)
	at javax.faces.CurrentThreadToServletContext$FactoryManagerCacheKey.<init>(CurrentThreadToServletContext.java:256)
	at javax.faces.CurrentThreadToServletContext.getApplicationFactoryManager(CurrentThreadToServletContext.java:104)
	at javax.faces.CurrentThreadToServletContext.getApplicationFactoryManager(CurrentThreadToServletContext.java:97)
	at javax.faces.FactoryFinder.getFactory(FactoryFinder.java:277)
	at javax.faces.context.FacesContext.getCurrentInstance(FacesContext.java:912)
(38 more lines...)
Collapse Failed JsfViewTests testRenderException History
< 1 sec
java.lang.AssertionError: java.lang.AssertionError
java.lang.AssertionError
	at javax.faces.CurrentThreadToServletContext$FactoryManagerCacheKey.initFromFactoryMap(CurrentThreadToServletContext.java:278)
	at javax.faces.CurrentThreadToServletContext$FactoryManagerCacheKey.<init>(CurrentThreadToServletContext.java:256)
	at javax.faces.CurrentThreadToServletContext.getApplicationFactoryManager(CurrentThreadToServletContext.java:104)
	at javax.faces.CurrentThreadToServletContext.getApplicationFactoryManager(CurrentThreadToServletContext.java:97)
	at javax.faces.FactoryFinder.getFactory(FactoryFinder.java:277)
	at javax.faces.context.FacesContext.getCurrentInstance(FacesContext.java:912)
(38 more lines...)
Collapse Failed JsfViewTests testSaveState History
< 1 sec
java.lang.AssertionError: java.lang.AssertionError
java.lang.AssertionError
	at javax.faces.CurrentThreadToServletContext$FactoryManagerCacheKey.initFromFactoryMap(CurrentThreadToServletContext.java:278)
	at javax.faces.CurrentThreadToServletContext$FactoryManagerCacheKey.<init>(CurrentThreadToServletContext.java:256)
	at javax.faces.CurrentThreadToServletContext.getApplicationFactoryManager(CurrentThreadToServletContext.java:104)
	at javax.faces.CurrentThreadToServletContext.getApplicationFactoryManager(CurrentThreadToServletContext.java:97)
	at javax.faces.FactoryFinder.getFactory(FactoryFinder.java:277)
	at javax.faces.context.FacesContext.getCurrentInstance(FacesContext.java:912)
(38 more lines...)
Collapse Failed JsfViewTests testUserEventQueued_FormSubmitted History
< 1 sec
java.lang.AssertionError: java.lang.AssertionError
java.lang.AssertionError
	at javax.faces.CurrentThreadToServletContext$FactoryManagerCacheKey.initFromFactoryMap(CurrentThreadToServletContext.java:278)
	at javax.faces.CurrentThreadToServletContext$FactoryManagerCacheKey.<init>(CurrentThreadToServletContext.java:256)
	at javax.faces.CurrentThreadToServletContext.getApplicationFactoryManager(CurrentThreadToServletContext.java:104)
	at javax.faces.CurrentThreadToServletContext.getApplicationFactoryManager(CurrentThreadToServletContext.java:97)
	at javax.faces.FactoryFinder.getFactory(FactoryFinder.java:277)
	at javax.faces.context.FacesContext.getCurrentInstance(FacesContext.java:912)
(38 more lines...)
Collapse Failed JsfViewTests testUserEventQueued_GETRefresh History
< 1 sec
java.lang.AssertionError: java.lang.AssertionError
java.lang.AssertionError
	at javax.faces.CurrentThreadToServletContext$FactoryManagerCacheKey.initFromFactoryMap(CurrentThreadToServletContext.java:278)
	at javax.faces.CurrentThreadToServletContext$FactoryManagerCacheKey.<init>(CurrentThreadToServletContext.java:256)
	at javax.faces.CurrentThreadToServletContext.getApplicationFactoryManager(CurrentThreadToServletContext.java:104)
	at javax.faces.CurrentThreadToServletContext.getApplicationFactoryManager(CurrentThreadToServletContext.java:97)
	at javax.faces.FactoryFinder.getFactory(FactoryFinder.java:277)
	at javax.faces.context.FacesContext.getCurrentInstance(FacesContext.java:912)
(38 more lines...)
Collapse Failed MyFacesFlowResponseStateManagerTests testDelegatesIsWriteStateAfterRenderViewRequired History
< 1 sec
java.lang.AssertionError: java.lang.AssertionError
java.lang.AssertionError
	at javax.faces.CurrentThreadToServletContext$FactoryManagerCacheKey.initFromFactoryMap(CurrentThreadToServletContext.java:278)
	at javax.faces.CurrentThreadToServletContext$FactoryManagerCacheKey.<init>(CurrentThreadToServletContext.java:256)
	at javax.faces.CurrentThreadToServletContext.getApplicationFactoryManager(CurrentThreadToServletContext.java:104)
	at javax.faces.CurrentThreadToServletContext.getApplicationFactoryManager(CurrentThreadToServletContext.java:91)
	at javax.faces.FactoryFinder.releaseFactories(FactoryFinder.java:332)
	at org.apache.myfaces.test.base.AbstractJsfTestCase.setUp(AbstractJsfTestCase.java:106)
(36 more lines...)
Collapse Failed MyFacesFlowResponseStateManagerTests testDelegatesWriteState History
< 1 sec
java.lang.AssertionError: java.lang.AssertionError
java.lang.AssertionError
	at javax.faces.CurrentThreadToServletContext$FactoryManagerCacheKey.initFromFactoryMap(CurrentThreadToServletContext.java:278)
	at javax.faces.CurrentThreadToServletContext$FactoryManagerCacheKey.<init>(CurrentThreadToServletContext.java:256)
	at javax.faces.CurrentThreadToServletContext.getApplicationFactoryManager(CurrentThreadToServletContext.java:104)
	at javax.faces.CurrentThreadToServletContext.getApplicationFactoryManager(CurrentThreadToServletContext.java:91)
	at javax.faces.FactoryFinder.releaseFactories(FactoryFinder.java:332)
	at org.apache.myfaces.test.base.AbstractJsfTestCase.setUp(AbstractJsfTestCase.java:106)
(36 more lines...)
Collapse Failed MyFacesFlowResponseStateManagerTests testTriggersSaveStateInFlowResponseStateManager History
< 1 sec
java.lang.AssertionError: java.lang.AssertionError
java.lang.AssertionError
	at javax.faces.CurrentThreadToServletContext$FactoryManagerCacheKey.initFromFactoryMap(CurrentThreadToServletContext.java:278)
	at javax.faces.CurrentThreadToServletContext$FactoryManagerCacheKey.<init>(CurrentThreadToServletContext.java:256)
	at javax.faces.CurrentThreadToServletContext.getApplicationFactoryManager(CurrentThreadToServletContext.java:104)
	at javax.faces.CurrentThreadToServletContext.getApplicationFactoryManager(CurrentThreadToServletContext.java:91)
	at javax.faces.FactoryFinder.releaseFactories(FactoryFinder.java:332)
	at org.apache.myfaces.test.base.AbstractJsfTestCase.setUp(AbstractJsfTestCase.java:106)
(36 more lines...)