Branch 1.0.x built using JDK 7

Build: #35 failed

Job: Default Job failed

Stages & jobs

  1. Default Stage

Job result summary

Completed
Duration
19 minutes
Revision
75c4b850f1b29eac0412deb9a8bd8e8b81b1fd35 75c4b850f1b29eac0412deb9a8bd8e8b81b1fd35
Total tests
688
Fixed in
#37 (Code changes detected)

Tests

  • 688 tests in total
  • 1 test failed
  • 1 failure is new
  • 9 minutes taken in total.
New test failures 1
Status Test Duration
Collapse Failed DatasetOutboundChannelAdapterPartitionedIntegrationTests testWritingDataset History
1 sec
java.lang.AssertionError: java.lang.AssertionError: Dataset partition path created
java.lang.AssertionError: Dataset partition path created
	at org.junit.Assert.fail(Assert.java:88)
	at org.junit.Assert.assertTrue(Assert.java:41)
	at org.springframework.xd.integration.hadoop.config.DatasetOutboundChannelAdapterPartitionedIntegrationTests.testWritingDataset(DatasetOutboundChannelAdapterPartitionedIntegrationTests.java:61)
	at sun.reflect.NativeMethodAccessorImpl.invoke0(Native Method)
	at sun.reflect.NativeMethodAccessorImpl.invoke(NativeMethodAccessorImpl.java:57)
	at sun.reflect.DelegatingMethodAccessorImpl.invoke(DelegatingMethodAccessorImpl.java:43)
(39 more lines...)