https://github.com/SpringSource/spring-xd

Build result summary

Details

Completed
Duration
17 minutes
Labels
None
Revision
6e8c4812e745b90b020ef5d751315a2127f55fcb 6e8c4812e745b90b020ef5d751315a2127f55fcb
Total tests
793
Fixed in
#1679 (Changes by Eric Bottard)

Tests

Responsible

No one has taken responsibility for this failure

Code commits

Author Commit Message Commit date
David Turanski <dturanski_at_gopivotal_dot_com> David Turanski <dturanski_at_gopivotal_dot_com> 6e8c4812e745b90b020ef5d751315a2127f55fcb 6e8c4812e745b90b020ef5d751315a2127f55fcb downgraded some dirt dependencies
David Turanski <dturanski_at_gopivotal_dot_com> David Turanski <dturanski_at_gopivotal_dot_com> 61b8eeb1bafbd285acf8c64489756e26d169181e 61b8eeb1bafbd285acf8c64489756e26d169181e modularize build.gradle

Tests

New test failures 1
Status Test View job Duration
Collapse Failed JobCommandWithHadoopTests testLaunchFtpHadoopJob History
Default Job 14 secs
java.lang.IllegalStateException: java.lang.IllegalStateException: timed out while waiting for job: myftphdfs
java.lang.IllegalStateException: timed out while waiting for job: myftphdfs
	at org.springframework.xd.shell.command.AbstractJobIntegrationTest.waitForJobCompletion(AbstractJobIntegrationTest.java:417)
	at org.springframework.xd.shell.command.AbstractJobIntegrationTest.executeJobLaunch(AbstractJobIntegrationTest.java:211)
	at org.springframework.xd.shell.command.JobCommandWithHadoopTests.testLaunchFtpHadoopJob(JobCommandWithHadoopTests.java:66)
	at sun.reflect.NativeMethodAccessorImpl.invoke0(Native Method)
	at sun.reflect.NativeMethodAccessorImpl.invoke(NativeMethodAccessorImpl.java:57)
	at sun.reflect.DelegatingMethodAccessorImpl.invoke(DelegatingMethodAccessorImpl.java:43)
(60 more lines...)