https://github.com/SpringSource/spring-xd

Build result summary

Details

Completed
Duration
12 minutes
Labels
None
Revision
8ae0433777d637e016fd150df92f462788927ee3 8ae0433777d637e016fd150df92f462788927ee3
Total tests
663
Fixed in
#1761 (Manual run by Ilayaperumal Gopinathan)

Tests

Responsible

No one has taken responsibility for this failure

Code commits

Author Commit Message Commit date
Sabby Anandan <sabby.anandan@gmail.com> Sabby Anandan <sabby.anandan@gmail.com> 8ae0433777d637e016fd150df92f462788927ee3 8ae0433777d637e016fd150df92f462788927ee3 Merge branch 'master' of https://github.com/spring-projects/spring-xd
Sabby Anandan <sabby.anandan@gmail.com> Sabby Anandan <sabby.anandan@gmail.com> 64fc38af75f54ea200dc3fc616d75c29249ff4d4 64fc38af75f54ea200dc3fc616d75c29249ff4d4 Merge branch 'dturanski-XD-2237' Test cases asssociated with the commit validates Py code changes. Ran through full test execution from this branch; test build successfully completed. Merging to master.
Sabby Anandan <sabby.anandan@gmail.com> Sabby Anandan <sabby.anandan@gmail.com> 6ca1f25b421e35c2640db19ba807fcc1e80ad5e9 6ca1f25b421e35c2640db19ba807fcc1e80ad5e9 Merge branch 'XD-2237' of https://github.com/dturanski/spring-xd into dturanski-XD-2237
David Turanski <dturanski_at_gopivotal_dot_com> David Turanski <dturanski_at_gopivotal_dot_com> e1cd96a3bc018dcb326b96e3dff372617005ba7b e1cd96a3bc018dcb326b96e3dff372617005ba7b XD-2237 removed stray .pyc and __init.py
David Turanski <dturanski_at_gopivotal_dot_com> David Turanski <dturanski_at_gopivotal_dot_com> a13344378841e47f629f23e8dd7ea0c8383c7c11 a13344378841e47f629f23e8dd7ea0c8383c7c11 XD-2237 add python module for implementing processor

Tests

New test failures 3
Status Test View job Duration
Collapse Failed ShellCommandProcessorTests echoTest History
Default Job < 1 sec
java.lang.RuntimeException: java.lang.RuntimeException: Stream closed between payloads
java.lang.RuntimeException: Stream closed between payloads
	at org.springframework.xd.extension.process.ShellCommandProcessor.receive(ShellCommandProcessor.java:137)
	at org.springframework.xd.extension.process.ShellCommandProcessor.sendAndReceive(ShellCommandProcessor.java:164)
	at org.springframework.xd.extension.process.ShellCommandProcessorTests.doEchoTest(ShellCommandProcessorTests.java:102)
	at org.springframework.xd.extension.process.ShellCommandProcessorTests.echoTest(ShellCommandProcessorTests.java:55)
	at sun.reflect.NativeMethodAccessorImpl.invoke0(Native Method)
	at sun.reflect.NativeMethodAccessorImpl.invoke(NativeMethodAccessorImpl.java:57)
(49 more lines...)
Collapse Failed ShellCommandProcessorTests echoTestWithLFEncoder History
Default Job < 1 sec
java.lang.RuntimeException: java.lang.RuntimeException: Stream closed between payloads
java.lang.RuntimeException: Stream closed between payloads
	at org.springframework.xd.extension.process.ShellCommandProcessor.receive(ShellCommandProcessor.java:137)
	at org.springframework.xd.extension.process.ShellCommandProcessor.sendAndReceive(ShellCommandProcessor.java:164)
	at org.springframework.xd.extension.process.ShellCommandProcessorTests.doEchoTest(ShellCommandProcessorTests.java:102)
	at org.springframework.xd.extension.process.ShellCommandProcessorTests.echoTestWithLFEncoder(ShellCommandProcessorTests.java:64)
	at sun.reflect.NativeMethodAccessorImpl.invoke0(Native Method)
	at sun.reflect.NativeMethodAccessorImpl.invoke(NativeMethodAccessorImpl.java:57)
(48 more lines...)
Collapse Failed ShellCommandProcessorTests testUTF8 History
Default Job < 1 sec
java.lang.RuntimeException: java.lang.RuntimeException: Stream closed between payloads
java.lang.RuntimeException: Stream closed between payloads
	at org.springframework.xd.extension.process.ShellCommandProcessor.receive(ShellCommandProcessor.java:137)
	at org.springframework.xd.extension.process.ShellCommandProcessor.sendAndReceive(ShellCommandProcessor.java:164)
	at org.springframework.xd.extension.process.ShellCommandProcessorTests.testUTF8(ShellCommandProcessorTests.java:114)
	at sun.reflect.NativeMethodAccessorImpl.invoke0(Native Method)
	at sun.reflect.NativeMethodAccessorImpl.invoke(NativeMethodAccessorImpl.java:57)
	at sun.reflect.DelegatingMethodAccessorImpl.invoke(DelegatingMethodAccessorImpl.java:43)
(48 more lines...)

Jira issues

IssueDescriptionStatus
Unknown Issue TypeXD-2237Could not obtain issue details from Jira