https://github.com/SpringSource/spring-xd

Build: #2152 failed Rebuilt by Ilayaperumal Gopinathan

Build result summary

Details

Completed
Duration
26 minutes
Labels
None
Revision
93225db7a58d1f4b95f7e06f505321bdd3453450 93225db7a58d1f4b95f7e06f505321bdd3453450
Total tests
708
Failing since
#2148 (Changes by BoykoAlex <aboyko@pivotal.io>)
Fixed in
#2159 (Changes by Eric Bottard)
Number of retries
1

Tests

Responsible

This build has been failing since #2148
No one has taken responsibility

Code commits

Author Commit Message Commit date
Ilayaperumal Gopinathan Ilayaperumal Gopinathan 93225db7a58d1f4b95f7e06f505321bdd3453450 93225db7a58d1f4b95f7e06f505321bdd3453450 Spark streaming tests fix
 - Add null check before shutting down the single node app

Tests

New test failures 2
Status Test View job Duration
Collapse Failed KafkaSingleNodeStreamDeploymentIntegrationTests verifyQueueChannelsRegisteredOnDemand History
Default Job 9 secs
org.springframework.beans.factory.NoSuchBeanDefinitionException: org.springframework.beans.factory.NoSuchBeanDefinitionException: No bean named 'queue:z' is defined
org.springframework.beans.factory.NoSuchBeanDefinitionException: No bean named 'queue:z' is defined
	at org.springframework.beans.factory.support.DefaultListableBeanFactory.getBeanDefinition(DefaultListableBeanFactory.java:687)
	at org.springframework.beans.factory.support.AbstractBeanFactory.getMergedLocalBeanDefinition(AbstractBeanFactory.java:1168)
	at org.springframework.beans.factory.support.AbstractBeanFactory.doGetBean(AbstractBeanFactory.java:281)
	at org.springframework.beans.factory.support.AbstractBeanFactory.getBean(AbstractBeanFactory.java:199)
	at org.springframework.beans.factory.support.AbstractBeanFactory.doGetBean(AbstractBeanFactory.java:272)
	at org.springframework.beans.factory.support.AbstractBeanFactory.getBean(AbstractBeanFactory.java:199)
(51 more lines...)
Collapse Failed KafkaSingleNodeStreamDeploymentIntegrationTests testTappingWithRepeatedModulesDoesNotDuplicateMessages History
Default Job 7 secs
java.lang.AssertionError: java.lang.AssertionError: expected:<DRACARYS!> but was:<null>
java.lang.AssertionError: expected:<DRACARYS!> but was:<null>
	at org.junit.Assert.fail(Assert.java:88)
	at org.junit.Assert.failNotEquals(Assert.java:834)
	at org.junit.Assert.assertEquals(Assert.java:118)
	at org.junit.Assert.assertEquals(Assert.java:144)
	at org.springframework.xd.dirt.stream.AbstractSingleNodeStreamDeploymentIntegrationTests.tapTest(AbstractSingleNodeStreamDeploymentIntegrationTests.java:608)
	at org.springframework.xd.dirt.stream.AbstractSingleNodeStreamDeploymentIntegrationTests.testTappingWithRepeatedModulesDoesNotDuplicateMessages(AbstractSingleNodeStreamDeploymentIntegrationTests.java:299)
(47 more lines...)