https://github.com/SpringSource/spring-xd

Build: #2185 failed Changes by David Turanski <dturanski@pivotal.io>

Build result summary

Details

Completed
Duration
124 minutes
Labels
None
Revision
24d4c69eccc91b63150b50a2a920401ecbc130dd 24d4c69eccc91b63150b50a2a920401ecbc130dd
Total tests
703
Fixed in
#2186 (Changes by David Turanski <dturanski@pivotal.io>)

Tests

Responsible

No one has taken responsibility for this failure

Code commits

Author Commit Message Commit date
David Turanski <dturanski@pivotal.io> David Turanski <dturanski@pivotal.io> 24d4c69eccc91b63150b50a2a920401ecbc130dd 24d4c69eccc91b63150b50a2a920401ecbc130dd enabled publication of distribution

Tests

New test failures 1
Status Test View job Duration
Collapse Failed KafkaSingleNodeStreamDeploymentIntegrationTests testTappingWithLabels History
Default Job 6 secs
java.lang.AssertionError: java.lang.AssertionError: expected:<DRACARYS!> but was:<null>
java.lang.AssertionError: expected:<DRACARYS!> but was:<null>
	at org.junit.Assert.fail(Assert.java:88)
	at org.junit.Assert.failNotEquals(Assert.java:834)
	at org.junit.Assert.assertEquals(Assert.java:118)
	at org.junit.Assert.assertEquals(Assert.java:144)
	at org.springframework.xd.dirt.stream.AbstractSingleNodeStreamDeploymentIntegrationTests.tapTest(AbstractSingleNodeStreamDeploymentIntegrationTests.java:609)
	at org.springframework.xd.dirt.stream.AbstractSingleNodeStreamDeploymentIntegrationTests.testTappingWithLabels(AbstractSingleNodeStreamDeploymentIntegrationTests.java:286)
(47 more lines...)