https://github.com/SpringSource/spring-xd

Build: #2201 failed Manual run by Mark Pollack

Build result summary

Details

Completed
Duration
52 minutes
Labels
None
Revision
27ace30c0fc6052cd8980380e28967dd98c5ce85 27ace30c0fc6052cd8980380e28967dd98c5ce85
Total tests
1112
Fixed in
#2204 (Manual run by Ilayaperumal Gopinathan)

Tests

Responsible

Code commits

Author Commit Message Commit date
Mark Pollack Mark Pollack 27ace30c0fc6052cd8980380e28967dd98c5ce85 27ace30c0fc6052cd8980380e28967dd98c5ce85 XD-3111 Upgrade to 1.2.0 RC1 Spring Integration Kafka

Tests

New test failures 2
Status Test View job Duration
Collapse Failed KafkaSourceSinkTests testKafkaSourceAndSink History
Default Job 40 secs
java.lang.AssertionError: java.lang.AssertionError
java.lang.AssertionError
	at org.junit.Assert.fail(Assert.java:86)
	at org.junit.Assert.assertTrue(Assert.java:41)
	at org.junit.Assert.assertTrue(Assert.java:52)
	at org.springframework.xd.shell.command.StreamCommandTemplate.verifyExists(StreamCommandTemplate.java:162)
	at org.springframework.xd.shell.command.StreamCommandTemplate.doCreate(StreamCommandTemplate.java:99)
	at org.springframework.xd.shell.command.StreamCommandTemplate.create(StreamCommandTemplate.java:65)
(64 more lines...)
Collapse Failed KafkaSourceSinkTests testKafkaSourceAndSinkWithMultiTopics History
Default Job 43 secs
java.lang.AssertionError: java.lang.AssertionError
java.lang.AssertionError
	at org.junit.Assert.fail(Assert.java:86)
	at org.junit.Assert.assertTrue(Assert.java:41)
	at org.junit.Assert.assertTrue(Assert.java:52)
	at org.springframework.xd.shell.command.StreamCommandTemplate.verifyExists(StreamCommandTemplate.java:162)
	at org.springframework.xd.shell.command.StreamCommandTemplate.doCreate(StreamCommandTemplate.java:99)
	at org.springframework.xd.shell.command.StreamCommandTemplate.create(StreamCommandTemplate.java:65)
(64 more lines...)

Jira issues

IssueDescriptionStatus
Unknown Issue TypeXD-3111Could not obtain issue details from Jira