https://github.com/SpringSource/spring-xd

Build: #2203 failed Manual run by Ilayaperumal Gopinathan

Build result summary

Details

Completed
Duration
27 minutes
Labels
None
Revision
149a36430be5eb23707df2258d313ce10d3e68f0 149a36430be5eb23707df2258d313ce10d3e68f0
Total tests
717
Failing since
#2201 (Manual run by Mark Pollack)
Fixed in
#2204 (Manual run by Ilayaperumal Gopinathan)

Tests

Responsible

Code commits

Author Commit Message Commit date
Ilayaperumal Gopinathan Ilayaperumal Gopinathan 149a36430be5eb23707df2258d313ce10d3e68f0 149a36430be5eb23707df2258d313ce10d3e68f0 Fix Kafka source `queueSize` option
 - Make sure the queueSize is a power of 2. Internally, this value is used
as `bufferSize` for the ring buffer in reactor
 - Fix module option message

Tests

New test failures 2
Status Test View job Duration
Collapse Failed ModuleOptionsMetadataSanityTests sanityChecks History
Default Job < 1 sec
java.lang.AssertionError: java.lang.AssertionError: ModuleOption description for source:kafka/queueSize should not end with a dot : 'the maximum number of messages held internally and waiting for processing, per concurrent handler. Value must be a power of 2.'
java.lang.AssertionError: ModuleOption description for source:kafka/queueSize should not end with a dot : 'the maximum number of messages held internally and waiting for processing, per concurrent handler. Value must be a power of 2.'
	at org.junit.Assert.fail(Assert.java:88)
	at org.junit.Assert.assertTrue(Assert.java:41)
	at org.junit.Assert.assertFalse(Assert.java:64)
	at org.springframework.xd.dirt.modules.metadata.ModuleOptionsMetadataSanityTests.sanityChecks(ModuleOptionsMetadataSanityTests.java:74)
	at sun.reflect.NativeMethodAccessorImpl.invoke0(Native Method)
	at sun.reflect.NativeMethodAccessorImpl.invoke(NativeMethodAccessorImpl.java:57)
(44 more lines...)
Collapse Failed KafkaSingleNodeStreamDeploymentIntegrationTests testBasicTap History
Default Job 4 secs
java.lang.AssertionError: java.lang.AssertionError: expected:<DRACARYS!> but was:<null>
java.lang.AssertionError: expected:<DRACARYS!> but was:<null>
	at org.junit.Assert.fail(Assert.java:88)
	at org.junit.Assert.failNotEquals(Assert.java:834)
	at org.junit.Assert.assertEquals(Assert.java:118)
	at org.junit.Assert.assertEquals(Assert.java:144)
	at org.springframework.xd.dirt.stream.AbstractSingleNodeStreamDeploymentIntegrationTests.tapTest(AbstractSingleNodeStreamDeploymentIntegrationTests.java:609)
	at org.springframework.xd.dirt.stream.AbstractSingleNodeStreamDeploymentIntegrationTests.testBasicTap(AbstractSingleNodeStreamDeploymentIntegrationTests.java:273)
(47 more lines...)