https://github.com/SpringSource/spring-xd

Build result summary

Details

Completed
Duration
27 minutes
Labels
None
Revision
936c22938d8b4914b5f2ea0ad719d274558d70f1 936c22938d8b4914b5f2ea0ad719d274558d70f1
Total tests
717
Fixed in
#2208 (Changes by Mark Pollack)

Tests

Responsible

No one has taken responsibility for this failure

Code commits

Author Commit Message Commit date
Franck MARCHAND <fmarchand@agaetis.fr> Franck MARCHAND <fmarchand@agaetis.fr> 936c22938d8b4914b5f2ea0ad719d274558d70f1 936c22938d8b4914b5f2ea0ad719d274558d70f1 XD-2717 Add nameExpression and dirExpression properties to File Sink

Tests

New test failures 1
Status Test View job Duration
Collapse Failed RabbitSingleNodeStreamDeploymentIntegrationTests testRoutingWithGroovy History
Default Job < 1 sec
org.springframework.xd.dirt.server.admin.deployment.DeploymentException: org.springframework.xd.dirt.server.admin.deployment.DeploymentException: routerDefinition
org.springframework.xd.dirt.server.admin.deployment.DeploymentException: routerDefinition
	at org.springframework.xd.dirt.stream.AbstractInstancePersistingDeployer.deployResource(AbstractInstancePersistingDeployer.java:134)
	at org.springframework.xd.dirt.stream.AbstractInstancePersistingDeployer.deploy(AbstractInstancePersistingDeployer.java:84)
	at org.springframework.xd.dirt.test.SingleNodeIntegrationTestSupport.waitForDeploy(SingleNodeIntegrationTestSupport.java:296)
	at org.springframework.xd.dirt.test.SingleNodeIntegrationTestSupport.waitForDeploy(SingleNodeIntegrationTestSupport.java:292)
	at org.springframework.xd.dirt.test.SingleNodeIntegrationTestSupport.deployStream(SingleNodeIntegrationTestSupport.java:157)
	at org.springframework.xd.dirt.stream.AbstractSingleNodeStreamDeploymentIntegrationTests.doTest(AbstractSingleNodeStreamDeploymentIntegrationTests.java:625)
(59 more lines...)

Jira issues

IssueDescriptionStatus
Unknown Issue TypeXD-2717Could not obtain issue details from Jira