https://github.com/SpringSource/spring-xd

Build: #2206 failed Changes by Mark Pollack

Build result summary

Details

Completed
Duration
77 minutes
Labels
None
Revision
d992a84c9372e3c31b4d83d262e9ee22f885db57 d992a84c9372e3c31b4d83d262e9ee22f885db57
Total tests
1113
Failing since
#2205 (Changes by Franck MARCHAND <fmarchand@agaetis.fr>)
Fixed in
#2208 (Changes by Mark Pollack)

Responsible

This build has been failing since #2205
No one has taken responsibility

Code commits

Author Commit Message Commit date
Mark Pollack Mark Pollack d992a84c9372e3c31b4d83d262e9ee22f885db57 d992a84c9372e3c31b4d83d262e9ee22f885db57 Update docs, readme to reference latest GA and current 1.2 RC release

Tests

New test failures 1
Status Test View job Duration
Collapse Failed FileSourceAndFileSinkTests testNameAndDirExpression History
Default Job 2 secs
java.lang.AssertionError: java.lang.AssertionError: expected:<true> but was:<is <true>>
java.lang.AssertionError: expected:<true> but was:<is <true>>
	at org.junit.Assert.fail(Assert.java:88)
	at org.junit.Assert.failNotEquals(Assert.java:834)
	at org.junit.Assert.assertEquals(Assert.java:118)
	at org.junit.Assert.assertEquals(Assert.java:144)
	at org.springframework.xd.shell.command.FileSourceAndFileSinkTests.testFileSinkSource(FileSourceAndFileSinkTests.java:148)
	at org.springframework.xd.shell.command.FileSourceAndFileSinkTests.testNameAndDirExpression(FileSourceAndFileSinkTests.java:76)
(62 more lines...)
Fixed tests 1
Status Test Failing since View job Duration
Successful RabbitSingleNodeStreamDeploymentIntegrationTests testRoutingWithGroovy History
Failing since build #2205 (Changes by Franck MARCHAND <fmarchand@agaetis.fr>) Default Job 2 secs