https://github.com/SpringSource/spring-xd

Build: #2206 failed Changes by Mark Pollack

Test results

  • 1,113 tests in total
  • 1 test failed
  • 1 failure is new
  • 1 test was fixed
  • 6 tests were quarantined / skipped
  • 21 minutes taken in total.
New test failures 1
Status Test View job Duration
Collapse Failed FileSourceAndFileSinkTests testNameAndDirExpression History
Default Job 2 secs
java.lang.AssertionError: java.lang.AssertionError: expected:<true> but was:<is <true>>
java.lang.AssertionError: expected:<true> but was:<is <true>>
	at org.junit.Assert.fail(Assert.java:88)
	at org.junit.Assert.failNotEquals(Assert.java:834)
	at org.junit.Assert.assertEquals(Assert.java:118)
	at org.junit.Assert.assertEquals(Assert.java:144)
	at org.springframework.xd.shell.command.FileSourceAndFileSinkTests.testFileSinkSource(FileSourceAndFileSinkTests.java:148)
	at org.springframework.xd.shell.command.FileSourceAndFileSinkTests.testNameAndDirExpression(FileSourceAndFileSinkTests.java:76)
(62 more lines...)
Fixed tests 1
Status Test Failing since View job Duration
Successful RabbitSingleNodeStreamDeploymentIntegrationTests testRoutingWithGroovy History
Failing since build #2205 (Changes by Franck MARCHAND <fmarchand@agaetis.fr>) Default Job 2 secs
Skipped tests 6
Status Test Failing since View job
Skipped KafkaMessageBusTests testDirectBinding History
Default Job
Skipped RawModeKafkaMessageBusTests testSendAndReceiveNoOriginalContentType History
Default Job
Skipped RawModeKafkaMessageBusTests testDirectBinding History
Default Job
Skipped KafkaSingleNodeStreamDeploymentIntegrationTests verifyQueueChannelsRegisteredOnDemand History
Failing since build #2152 (Rebuilt by Ilayaperumal Gopinathan) Default Job
Skipped KafkaSingleNodeStreamDeploymentIntegrationTests testTappingWithRepeatedModulesDoesNotDuplicateMessages History
Default Job
Skipped StreamCommandTests testJsonPath History
Default Job