https://github.com/SpringSource/spring-xd

Build: #2207 failed Changes by Gary Russell

Build result summary

Details

Completed
Duration
40 minutes
Labels
None
Revision
c9b626a2e084f45076df8094dfa95782c3758212 c9b626a2e084f45076df8094dfa95782c3758212
Total tests
1113
Failing since
#2205 (Changes by Franck MARCHAND <fmarchand@agaetis.fr>)
Fixed in
#2208 (Changes by Mark Pollack)

Tests

Responsible

This build has been failing since #2205
No one has taken responsibility

Code commits

Author Commit Message Commit date
Gary Russell Gary Russell c9b626a2e084f45076df8094dfa95782c3758212 c9b626a2e084f45076df8094dfa95782c3758212 XD-3110: Fix Duplicate Package
extension-tcp and extension-encoder-support had the same package.

Tests

Existing test failures 1
Status Test Failing since View job Duration
java.lang.AssertionError: java.lang.AssertionError: expected:<true> but was:<is <true>>
java.lang.AssertionError: expected:<true> but was:<is <true>>
	at org.junit.Assert.fail(Assert.java:88)
	at org.junit.Assert.failNotEquals(Assert.java:834)
	at org.junit.Assert.assertEquals(Assert.java:118)
	at org.junit.Assert.assertEquals(Assert.java:144)
	at org.springframework.xd.shell.command.FileSourceAndFileSinkTests.testFileSinkSource(FileSourceAndFileSinkTests.java:148)
	at org.springframework.xd.shell.command.FileSourceAndFileSinkTests.testNameAndDirExpression(FileSourceAndFileSinkTests.java:76)
(62 more lines...)

Jira issues

IssueDescriptionStatus
Unknown Issue TypeXD-3110Could not obtain issue details from Jira