https://github.com/SpringSource/spring-xd

Build: #2207 failed Changes by Gary Russell

Test results

  • 1,113 tests in total
  • 1 test failed
  • 6 tests were quarantined / skipped
  • 21 minutes taken in total.
Existing test failures 1
Status Test Failing since View job Duration
java.lang.AssertionError: java.lang.AssertionError: expected:<true> but was:<is <true>>
java.lang.AssertionError: expected:<true> but was:<is <true>>
	at org.junit.Assert.fail(Assert.java:88)
	at org.junit.Assert.failNotEquals(Assert.java:834)
	at org.junit.Assert.assertEquals(Assert.java:118)
	at org.junit.Assert.assertEquals(Assert.java:144)
	at org.springframework.xd.shell.command.FileSourceAndFileSinkTests.testFileSinkSource(FileSourceAndFileSinkTests.java:148)
	at org.springframework.xd.shell.command.FileSourceAndFileSinkTests.testNameAndDirExpression(FileSourceAndFileSinkTests.java:76)
(62 more lines...)
Skipped tests 6
Status Test Failing since View job
Skipped KafkaMessageBusTests testDirectBinding History
Default Job
Skipped RawModeKafkaMessageBusTests testSendAndReceiveNoOriginalContentType History
Default Job
Skipped RawModeKafkaMessageBusTests testDirectBinding History
Default Job
Skipped KafkaSingleNodeStreamDeploymentIntegrationTests verifyQueueChannelsRegisteredOnDemand History
Failing since build #2152 (Rebuilt by Ilayaperumal Gopinathan) Default Job
Skipped KafkaSingleNodeStreamDeploymentIntegrationTests testTappingWithRepeatedModulesDoesNotDuplicateMessages History
Default Job
Skipped StreamCommandTests testJsonPath History
Default Job