https://github.com/SpringSource/spring-xd

Build: #2217 failed Changes by Ilayaperumal Gopinathan

Build result summary

Details

Completed
Duration
101 minutes
Labels
None
Revision
50e0f8298b3c6808316ead0a082eb34804ceb857 50e0f8298b3c6808316ead0a082eb34804ceb857
Total tests
717
Fixed in
#2219 (Manual run by Mark Pollack)

Tests

Responsible

Code commits

Author Commit Message Commit date
Ilayaperumal Gopinathan Ilayaperumal Gopinathan 50e0f8298b3c6808316ead0a082eb34804ceb857 50e0f8298b3c6808316ead0a082eb34804ceb857 XD-3130 Create RabbitManagementUtils
 - Move `buildRestTemplate` method from `BusUtils` to a new class `RabbitManagementUtils`
 - Since `Spark-streaming` uses `BusUtils`, this change would make Spark streaming not
to depend on `httpClient` that is used by the bus cleaner util method to build rest template

Rename `BusCleanerUtils` to `RabbitManagementUtils`

Tests

New test failures 1
Status Test View job Duration
Collapse Failed RabbitSingleNodeStreamDeploymentIntegrationTests directBindingNotEnabledWithOverriddenCount History
Default Job < 1 sec
org.springframework.xd.dirt.server.admin.deployment.DeploymentException: org.springframework.xd.dirt.server.admin.deployment.DeploymentException: directBindingNotEnabledWithOverriddenCount
org.springframework.xd.dirt.server.admin.deployment.DeploymentException: directBindingNotEnabledWithOverriddenCount
	at org.springframework.xd.dirt.stream.AbstractInstancePersistingDeployer.deployResource(AbstractInstancePersistingDeployer.java:134)
	at org.springframework.xd.dirt.stream.AbstractInstancePersistingDeployer.deploy(AbstractInstancePersistingDeployer.java:84)
	at org.springframework.xd.dirt.test.SingleNodeIntegrationTestSupport.waitForDeploy(SingleNodeIntegrationTestSupport.java:306)
	at org.springframework.xd.dirt.test.SingleNodeIntegrationTestSupport.deployStream(SingleNodeIntegrationTestSupport.java:179)
	at org.springframework.xd.dirt.stream.AbstractDistributedTransportSingleNodeStreamDeploymentIntegrationTests.directBindingNotEnabledWithOverriddenCount(AbstractDistributedTransportSingleNodeStreamDeploymentIntegrationTests.java:115)
	at sun.reflect.NativeMethodAccessorImpl.invoke0(Native Method)
(56 more lines...)

Jira issues

IssueDescriptionStatus
Unknown Issue TypeXD-3130Could not obtain issue details from Jira