https://github.com/SpringSource/spring-xd

Build: #2218 failed Changes by 3 people

Build result summary

Details

Completed
Duration
100 minutes
Labels
None
Revision
66df492dbe960caf7150bead582d634b912aa09e 66df492dbe960caf7150bead582d634b912aa09e
Total tests
717
Failing since
#2217 (Changes by Ilayaperumal Gopinathan)
Fixed in
#2219 (Manual run by Mark Pollack)

Responsible

Code commits

Author Commit Message Commit date
Mark Pollack Mark Pollack 66df492dbe960caf7150bead582d634b912aa09e 66df492dbe960caf7150bead582d634b912aa09e Add docs for increase of default size of the ring buffer
Thomas Risberg Thomas Risberg 593810d614182b58ff6af8e8342e637b8e18abd8 593810d614182b58ff6af8e8342e637b8e18abd8 XD-3133 Update YARN deployment classpath settings for HDP 2.2 and PHD 3.0
- making indentation consistent
Marius Bogoevici <mbogoevici@pivotal.io> Marius Bogoevici <mbogoevici@pivotal.io> f6aa1afa7489008da91ab5703ac6aa06858f23fb f6aa1afa7489008da91ab5703ac6aa06858f23fb Increase the default size of the ringbuffer

Tests

New test failures 1
Status Test View job Duration
Collapse Failed KafkaSingleNodeStreamDeploymentIntegrationTests testBasicTap History
Default Job 4 secs
java.lang.AssertionError: java.lang.AssertionError: expected:<DRACARYS!> but was:<null>
java.lang.AssertionError: expected:<DRACARYS!> but was:<null>
	at org.junit.Assert.fail(Assert.java:88)
	at org.junit.Assert.failNotEquals(Assert.java:834)
	at org.junit.Assert.assertEquals(Assert.java:118)
	at org.junit.Assert.assertEquals(Assert.java:144)
	at org.springframework.xd.dirt.stream.AbstractSingleNodeStreamDeploymentIntegrationTests.tapTest(AbstractSingleNodeStreamDeploymentIntegrationTests.java:609)
	at org.springframework.xd.dirt.stream.AbstractSingleNodeStreamDeploymentIntegrationTests.testBasicTap(AbstractSingleNodeStreamDeploymentIntegrationTests.java:273)
(47 more lines...)
Fixed tests 1
Status Test Failing since View job Duration
Successful RabbitSingleNodeStreamDeploymentIntegrationTests directBindingNotEnabledWithOverriddenCount History
Failing since build #2217 (Changes by Ilayaperumal Gopinathan) Default Job 1 sec

Jira issues

IssueDescriptionStatus
Unknown Issue TypeXD-3133Could not obtain issue details from Jira