https://github.com/SpringSource/spring-xd

Build: #2222 failed Manual run by Gunnar Hillert

Build result summary

Details

Completed
Duration
28 minutes
Labels
None
Revision
195bce0ac101f824ce5a3f4c50922f556617b037 195bce0ac101f824ce5a3f4c50922f556617b037
Total tests
717
Failing since
#2220 (Manual run by Gunnar Hillert)
Fixed in
#2223 (Manual run by Gunnar Hillert)

Tests

Responsible

This build has been failing since #2220
No one has taken responsibility

Tests

New test failures 1
Status Test View job Duration
Collapse Failed RabbitSingleNodeStreamDeploymentIntegrationTests directBindingEnabledWithExplicitModuleCounts History
Default Job < 1 sec
org.springframework.xd.dirt.server.admin.deployment.DeploymentException: org.springframework.xd.dirt.server.admin.deployment.DeploymentException: directBindingEnabledWithExplicitModuleCounts
org.springframework.xd.dirt.server.admin.deployment.DeploymentException: directBindingEnabledWithExplicitModuleCounts
	at org.springframework.xd.dirt.stream.AbstractInstancePersistingDeployer.deployResource(AbstractInstancePersistingDeployer.java:134)
	at org.springframework.xd.dirt.stream.AbstractInstancePersistingDeployer.deploy(AbstractInstancePersistingDeployer.java:84)
	at org.springframework.xd.dirt.test.SingleNodeIntegrationTestSupport.waitForDeploy(SingleNodeIntegrationTestSupport.java:296)
	at org.springframework.xd.dirt.test.SingleNodeIntegrationTestSupport.deployStream(SingleNodeIntegrationTestSupport.java:167)
	at org.springframework.xd.dirt.stream.AbstractDistributedTransportSingleNodeStreamDeploymentIntegrationTests.directBindingEnabledWithExplicitModuleCounts(AbstractDistributedTransportSingleNodeStreamDeploymentIntegrationTests.java:48)
	at sun.reflect.NativeMethodAccessorImpl.invoke0(Native Method)
(56 more lines...)