https://github.com/SpringSource/spring-xd

Build: #2222 failed Manual run by Gunnar Hillert

Test results

  • 717 tests in total
  • 1 test failed
  • 1 failure is new
  • 5 tests were quarantined / skipped
  • 13 minutes taken in total.
New test failures 1
Status Test View job Duration
Collapse Failed RabbitSingleNodeStreamDeploymentIntegrationTests directBindingEnabledWithExplicitModuleCounts History
Default Job < 1 sec
org.springframework.xd.dirt.server.admin.deployment.DeploymentException: org.springframework.xd.dirt.server.admin.deployment.DeploymentException: directBindingEnabledWithExplicitModuleCounts
org.springframework.xd.dirt.server.admin.deployment.DeploymentException: directBindingEnabledWithExplicitModuleCounts
	at org.springframework.xd.dirt.stream.AbstractInstancePersistingDeployer.deployResource(AbstractInstancePersistingDeployer.java:134)
	at org.springframework.xd.dirt.stream.AbstractInstancePersistingDeployer.deploy(AbstractInstancePersistingDeployer.java:84)
	at org.springframework.xd.dirt.test.SingleNodeIntegrationTestSupport.waitForDeploy(SingleNodeIntegrationTestSupport.java:296)
	at org.springframework.xd.dirt.test.SingleNodeIntegrationTestSupport.deployStream(SingleNodeIntegrationTestSupport.java:167)
	at org.springframework.xd.dirt.stream.AbstractDistributedTransportSingleNodeStreamDeploymentIntegrationTests.directBindingEnabledWithExplicitModuleCounts(AbstractDistributedTransportSingleNodeStreamDeploymentIntegrationTests.java:48)
	at sun.reflect.NativeMethodAccessorImpl.invoke0(Native Method)
(56 more lines...)
Skipped tests 5
Status Test Failing since View job
Skipped KafkaMessageBusTests testDirectBinding History
Default Job
Skipped RawModeKafkaMessageBusTests testSendAndReceiveNoOriginalContentType History
Default Job
Skipped RawModeKafkaMessageBusTests testDirectBinding History
Default Job
Skipped KafkaSingleNodeStreamDeploymentIntegrationTests verifyQueueChannelsRegisteredOnDemand History
Failing since build #2152 (Rebuilt by Ilayaperumal Gopinathan) Default Job
Skipped KafkaSingleNodeStreamDeploymentIntegrationTests testTappingWithRepeatedModulesDoesNotDuplicateMessages History
Default Job