https://github.com/SpringSource/spring-xd

Build: #2224 failed Changes by Gary Russell

Build result summary

Details

Completed
Duration
110 minutes
Labels
None
Revision
6d265974267ff047aa125953039648bcb6ed9c80 6d265974267ff047aa125953039648bcb6ed9c80
Total tests
1113
Fixed in
#2227 (Changes by Janne Valkealahti)

Tests

Responsible

Code commits

Author Commit Message Commit date
Gary Russell Gary Russell 6d265974267ff047aa125953039648bcb6ed9c80 6d265974267ff047aa125953039648bcb6ed9c80 XD-3113: Resolve Most Sonar Critical Violations
JIRA: XD-3113">https://jira.spring.io/browse/XD-3113

Does __not__ address the cases where classes implement `Comparable` but
don't override `equals()`.

Configuration changes

Plan configuration has changed since the last successful build. See the plan audit log for more details.

Tests

New test failures 1
Status Test View job Duration
Collapse Failed FtpModulesTests testBasicSinkModuleBehavior History
Default Job 1 sec
java.lang.AssertionError: java.lang.AssertionError: only one file should have been created !
Expected: is <1>
     but: was <0>
java.lang.AssertionError: only one file should have been created !
Expected: is <1>
     but: was <0>
	at org.hamcrest.MatcherAssert.assertThat(MatcherAssert.java:20)
	at org.junit.Assert.assertThat(Assert.java:956)
(62 more lines...)

Jira issues

IssueDescriptionStatus
Unknown Issue TypeXD-3113Could not obtain issue details from Jira