https://github.com/SpringSource/spring-xd

Build: #2224 failed Changes by Gary Russell

Test results

  • 1,113 tests in total
  • 1 test failed
  • 1 failure is new
  • 6 tests were quarantined / skipped
  • 21 minutes taken in total.
New test failures 1
Status Test View job Duration
Collapse Failed FtpModulesTests testBasicSinkModuleBehavior History
Default Job 1 sec
java.lang.AssertionError: java.lang.AssertionError: only one file should have been created !
Expected: is <1>
     but: was <0>
java.lang.AssertionError: only one file should have been created !
Expected: is <1>
     but: was <0>
	at org.hamcrest.MatcherAssert.assertThat(MatcherAssert.java:20)
	at org.junit.Assert.assertThat(Assert.java:956)
(62 more lines...)
Skipped tests 6
Status Test Failing since View job
Skipped KafkaMessageBusTests testDirectBinding History
Default Job
Skipped RawModeKafkaMessageBusTests testSendAndReceiveNoOriginalContentType History
Default Job
Skipped RawModeKafkaMessageBusTests testDirectBinding History
Default Job
Skipped KafkaSingleNodeStreamDeploymentIntegrationTests verifyQueueChannelsRegisteredOnDemand History
Failing since build #2152 (Rebuilt by Ilayaperumal Gopinathan) Default Job
Skipped KafkaSingleNodeStreamDeploymentIntegrationTests testTappingWithRepeatedModulesDoesNotDuplicateMessages History
Default Job
Skipped StreamCommandTests testJsonPath History
Default Job