https://github.com/SpringSource/spring-xd

Build: #2225 failed Changes by Ilayaperumal Gopinathan

Build result summary

Details

Completed
Duration
28 minutes
Labels
None
Revision
7d19adcf9302c2f58ec95c7ecacb70166387d88a 7d19adcf9302c2f58ec95c7ecacb70166387d88a
Total tests
717
Failing since
#2224 (Changes by Gary Russell)
Fixed in
#2227 (Changes by Janne Valkealahti)

Tests

Responsible

Code commits

Author Commit Message Commit date
Ilayaperumal Gopinathan Ilayaperumal Gopinathan 7d19adcf9302c2f58ec95c7ecacb70166387d88a 7d19adcf9302c2f58ec95c7ecacb70166387d88a XD-3131 Disable tap listener for spark streaming plugin
 - This avoids the creation of the curator pathchildren cache thread for Taplistener when the
SparkStreamingPlugin is initialized

Configuration changes

Plan configuration has changed since the last successful build. See the plan audit log for more details.

Tests

New test failures 1
Status Test View job Duration
Collapse Failed KafkaSingleNodeStreamDeploymentIntegrationTests testBasicTap History
Default Job 5 secs
java.lang.AssertionError: java.lang.AssertionError: expected:<DRACARYS!> but was:<null>
java.lang.AssertionError: expected:<DRACARYS!> but was:<null>
	at org.junit.Assert.fail(Assert.java:88)
	at org.junit.Assert.failNotEquals(Assert.java:834)
	at org.junit.Assert.assertEquals(Assert.java:118)
	at org.junit.Assert.assertEquals(Assert.java:144)
	at org.springframework.xd.dirt.stream.AbstractSingleNodeStreamDeploymentIntegrationTests.tapTest(AbstractSingleNodeStreamDeploymentIntegrationTests.java:609)
	at org.springframework.xd.dirt.stream.AbstractSingleNodeStreamDeploymentIntegrationTests.testBasicTap(AbstractSingleNodeStreamDeploymentIntegrationTests.java:273)
(47 more lines...)

Jira issues

IssueDescriptionStatus
Unknown Issue TypeXD-3131Could not obtain issue details from Jira