https://github.com/SpringSource/spring-xd

Build: #2233 failed Changes by David Turanski <dturanski@pivotal.io>

Build result summary

Details

Completed
Duration
27 minutes
Labels
None
Revision
de27c762de88a648f64c67fd08ab52ce63ac00bc de27c762de88a648f64c67fd08ab52ce63ac00bc
Total tests
717
Failing since
#2232 (Changes by Eric Bottard)
Fixed in
#2234 (Changes by David Turanski <dturanski@pivotal.io>)

Responsible

This build has been failing since #2232
No one has taken responsibility

Code commits

Author Commit Message Commit date
David Turanski <dturanski@pivotal.io> David Turanski <dturanski@pivotal.io> de27c762de88a648f64c67fd08ab52ce63ac00bc de27c762de88a648f64c67fd08ab52ce63ac00bc move counters and gauges to its own page

Tests

New test failures 1
Status Test View job Duration
Collapse Failed KafkaMessageBusTests testPartitionedModuleJava History
Default Job 1 sec
java.lang.AssertionError: java.lang.AssertionError
java.lang.AssertionError
	at org.junit.Assert.fail(Assert.java:86)
	at org.junit.Assert.assertTrue(Assert.java:41)
	at org.junit.Assert.assertNotNull(Assert.java:712)
	at org.junit.Assert.assertNotNull(Assert.java:722)
	at org.springframework.xd.dirt.integration.bus.PartitionCapableBusTests.testPartitionedModuleJava(PartitionCapableBusTests.java:225)
	at sun.reflect.NativeMethodAccessorImpl.invoke0(Native Method)
(42 more lines...)
Fixed tests 1
Status Test Failing since View job Duration
Successful RabbitSingleNodeStreamDeploymentIntegrationTests directBindingNotEnabledWithMismatchedCounts History
Failing since build #2232 (Changes by Eric Bottard) Default Job 1 sec