https://github.com/SpringSource/spring-xd

Build: #2233 failed Changes by David Turanski <dturanski@pivotal.io>

Test results

  • 717 tests in total
  • 1 test failed
  • 1 failure is new
  • 1 test was fixed
  • 5 tests were quarantined / skipped
  • 13 minutes taken in total.
New test failures 1
Status Test View job Duration
Collapse Failed KafkaMessageBusTests testPartitionedModuleJava History
Default Job 1 sec
java.lang.AssertionError: java.lang.AssertionError
java.lang.AssertionError
	at org.junit.Assert.fail(Assert.java:86)
	at org.junit.Assert.assertTrue(Assert.java:41)
	at org.junit.Assert.assertNotNull(Assert.java:712)
	at org.junit.Assert.assertNotNull(Assert.java:722)
	at org.springframework.xd.dirt.integration.bus.PartitionCapableBusTests.testPartitionedModuleJava(PartitionCapableBusTests.java:225)
	at sun.reflect.NativeMethodAccessorImpl.invoke0(Native Method)
(42 more lines...)
Fixed tests 1
Status Test Failing since View job Duration
Successful RabbitSingleNodeStreamDeploymentIntegrationTests directBindingNotEnabledWithMismatchedCounts History
Failing since build #2232 (Changes by Eric Bottard) Default Job 1 sec
Skipped tests 5
Status Test Failing since View job
Skipped KafkaMessageBusTests testDirectBinding History
Default Job
Skipped RawModeKafkaMessageBusTests testSendAndReceiveNoOriginalContentType History
Default Job
Skipped RawModeKafkaMessageBusTests testDirectBinding History
Default Job
Skipped KafkaSingleNodeStreamDeploymentIntegrationTests verifyQueueChannelsRegisteredOnDemand History
Failing since build #2152 (Rebuilt by Ilayaperumal Gopinathan) Default Job
Skipped KafkaSingleNodeStreamDeploymentIntegrationTests testTappingWithRepeatedModulesDoesNotDuplicateMessages History
Default Job