https://github.com/SpringSource/spring-xd

Build: #2243 failed Changes by Eric Bottard

Build result summary

Details

Completed
Duration
95 minutes
Labels
None
Revision
dec08262dfe945ada0b6ebb0cd5da9c91484e67b dec08262dfe945ada0b6ebb0cd5da9c91484e67b
Total tests
725
Fixed in
#2246 (Changes by Mark Pollack and Marius Bogoevici <mbogoevici@pivotal.io>)

Tests

Responsible

No one has taken responsibility for this failure

Code commits

Author Commit Message Commit date
Eric Bottard Eric Bottard dec08262dfe945ada0b6ebb0cd5da9c91484e67b dec08262dfe945ada0b6ebb0cd5da9c91484e67b Updated Jobs
Eric Bottard Eric Bottard 5348cd3e8476eed2836fe2467c637505d950a63d 5348cd3e8476eed2836fe2467c637505d950a63d XD-3160: Reorganize module list
Eric Bottard Eric Bottard 346587137422e96999d4c524ce32fcbfb0fb645e 346587137422e96999d4c524ce32fcbfb0fb645e XD-3160: Reorganize modules alphabetically

Tests

New test failures 1
Status Test View job Duration
Collapse Failed KafkaMessageBusTests testPartitionedModuleSpEL History
Default Job 2 secs
java.lang.AssertionError: java.lang.AssertionError
java.lang.AssertionError
	at org.junit.Assert.fail(Assert.java:86)
	at org.junit.Assert.assertTrue(Assert.java:41)
	at org.junit.Assert.assertNotNull(Assert.java:712)
	at org.junit.Assert.assertNotNull(Assert.java:722)
	at org.springframework.xd.dirt.integration.bus.PartitionCapableBusTests.testPartitionedModuleSpEL(PartitionCapableBusTests.java:137)
	at sun.reflect.NativeMethodAccessorImpl.invoke0(Native Method)
(42 more lines...)

Jira issues

IssueDescriptionStatus
Unknown Issue TypeXD-3160Could not obtain issue details from Jira