https://github.com/SpringSource/spring-xd

Build: #2257 failed Changes by Thomas Risberg

Test results

  • 728 tests in total
  • 2 tests failed
  • 2 failures are new
  • 5 tests were quarantined / skipped
  • 13 minutes taken in total.
New test failures 2
Status Test View job Duration
Collapse Failed FileSourceModuleTests testFileReference History
Default Job < 1 sec
org.springframework.beans.factory.xml.XmlBeanDefinitionStoreException: org.springframework.beans.factory.xml.XmlBeanDefinitionStoreException: Line 7 in XML document from file [/data/bamboo-home/xml-data/build-dir/XD-MASTER-JOB1/spring-xd-dirt/build/resources/test/testmodules/sink/sink/config/sink.xml] is invalid; nested exception is org.xml.sax.SAXParseException; lineNumber: 7; columnNumber: 78; cvc-elt.1: Cannot find the declaration of element 'beans:beans'.
org.springframework.beans.factory.xml.XmlBeanDefinitionStoreException: Line 7 in XML document from file [/data/bamboo-home/xml-data/build-dir/XD-MASTER-JOB1/spring-xd-dirt/build/resources/test/testmodules/sink/sink/config/sink.xml] is invalid; nested exception is org.xml.sax.SAXParseException; lineNumber: 7; columnNumber: 78; cvc-elt.1: Cannot find the declaration of element 'beans:beans'.
	at org.springframework.beans.factory.xml.XmlBeanDefinitionReader.doLoadBeanDefinitions(XmlBeanDefinitionReader.java:399)
	at org.springframework.beans.factory.xml.XmlBeanDefinitionReader.loadBeanDefinitions(XmlBeanDefinitionReader.java:336)
	at org.springframework.beans.factory.xml.XmlBeanDefinitionReader.loadBeanDefinitions(XmlBeanDefinitionReader.java:304)
	at org.springframework.xd.module.options.DefaultModuleOptionsMetadataResolver.inferModuleOptionsMetadata(DefaultModuleOptionsMetadataResolver.java:255)
	at org.springframework.xd.module.options.DefaultModuleOptionsMetadataResolver.resolveNormalMetadata(DefaultModuleOptionsMetadataResolver.java:196)
	at org.springframework.xd.module.options.DefaultModuleOptionsMetadataResolver.resolve(DefaultModuleOptionsMetadataResolver.java:170)
(76 more lines...)
Collapse Failed KafkaSingleNodeStreamDeploymentIntegrationTests testTappingWithLabels History
Default Job 5 secs
java.lang.AssertionError: java.lang.AssertionError: expected:<DRACARYS!> but was:<null>
java.lang.AssertionError: expected:<DRACARYS!> but was:<null>
	at org.junit.Assert.fail(Assert.java:88)
	at org.junit.Assert.failNotEquals(Assert.java:834)
	at org.junit.Assert.assertEquals(Assert.java:118)
	at org.junit.Assert.assertEquals(Assert.java:144)
	at org.springframework.xd.dirt.stream.AbstractSingleNodeStreamDeploymentIntegrationTests.tapTest(AbstractSingleNodeStreamDeploymentIntegrationTests.java:609)
	at org.springframework.xd.dirt.stream.AbstractSingleNodeStreamDeploymentIntegrationTests.testTappingWithLabels(AbstractSingleNodeStreamDeploymentIntegrationTests.java:286)
(47 more lines...)
Skipped tests 5
Status Test Failing since View job
Skipped KafkaMessageBusTests testDirectBinding History
Default Job
Skipped RawModeKafkaMessageBusTests testSendAndReceiveNoOriginalContentType History
Default Job
Skipped RawModeKafkaMessageBusTests testDirectBinding History
Default Job
Skipped KafkaSingleNodeStreamDeploymentIntegrationTests verifyQueueChannelsRegisteredOnDemand History
Failing since build #2152 (Rebuilt by Ilayaperumal Gopinathan) Default Job
Skipped KafkaSingleNodeStreamDeploymentIntegrationTests testTappingWithRepeatedModulesDoesNotDuplicateMessages History
Default Job