https://github.com/SpringSource/spring-xd

Build: #2259 failed Changes by Michael Minella

Build result summary

Details

Completed
Duration
79 minutes
Labels
None
Revision
7f43fee29c0d41e41b005b3f2a6e01a3a8dd10f9 7f43fee29c0d41e41b005b3f2a6e01a3a8dd10f9
Total tests
732
Fixed in
#2260 (Changes by Ilayaperumal Gopinathan)

Tests

Responsible

Code commits

Author Commit Message Commit date
Michael Minella Michael Minella 7f43fee29c0d41e41b005b3f2a6e01a3a8dd10f9 7f43fee29c0d41e41b005b3f2a6e01a3a8dd10f9 XD-3188 Changed FileDeletionStepExecutionListener to be step scoped.

Tests

New test failures 1
Status Test View job Duration
Collapse Failed RabbitSingleNodeStreamDeploymentIntegrationTests directBindingEnabledForPartOfStream History
Default Job < 1 sec
org.springframework.xd.dirt.server.admin.deployment.DeploymentException: org.springframework.xd.dirt.server.admin.deployment.DeploymentException: directBindingEnabledForPartOfStream
org.springframework.xd.dirt.server.admin.deployment.DeploymentException: directBindingEnabledForPartOfStream
	at org.springframework.xd.dirt.stream.AbstractInstancePersistingDeployer.deployResource(AbstractInstancePersistingDeployer.java:134)
	at org.springframework.xd.dirt.stream.AbstractInstancePersistingDeployer.deploy(AbstractInstancePersistingDeployer.java:84)
	at org.springframework.xd.dirt.test.SingleNodeIntegrationTestSupport.waitForDeploy(SingleNodeIntegrationTestSupport.java:296)
	at org.springframework.xd.dirt.test.SingleNodeIntegrationTestSupport.deployStream(SingleNodeIntegrationTestSupport.java:167)
	at org.springframework.xd.dirt.stream.AbstractDistributedTransportSingleNodeStreamDeploymentIntegrationTests.directBindingEnabledForPartOfStream(AbstractDistributedTransportSingleNodeStreamDeploymentIntegrationTests.java:153)
	at sun.reflect.NativeMethodAccessorImpl.invoke0(Native Method)
(56 more lines...)

Jira issues

IssueDescriptionStatus
Unknown Issue TypeXD-3188Could not obtain issue details from Jira