https://github.com/SpringSource/spring-xd

Build result summary

Details

Completed
Duration
2 minutes
Labels
None
Agent
linux64-01-local
Revision
82f9c51c236bf8fbd15e4e2f1ab13ff346143963 82f9c51c236bf8fbd15e4e2f1ab13ff346143963
Total tests
71
Fixed in
#585 (Rebuilt once)

Tests

Responsible

No one has taken responsibility for this failure

Code commits

Author Commit Message Commit date
David Turanski <dturanski_at_gopivotal_dot_com> David Turanski <dturanski_at_gopivotal_dot_com> 82f9c51c236bf8fbd15e4e2f1ab13ff346143963 82f9c51c236bf8fbd15e4e2f1ab13ff346143963 removed transport local guard from SingleNodeMain

Tests

New test failures 27
Status Test View job Duration
Collapse Failed GaugeHandlerTests testhandlerWithExpression History
Default Job < 1 sec
java.lang.AssertionError: java.lang.AssertionError: REDIS IS NOT AVAILABLE
java.lang.AssertionError: REDIS IS NOT AVAILABLE
	at org.junit.Assert.fail(Assert.java:88)
	at org.springframework.xd.test.AbstractExternalServerAvailableRule.failOrSkipTests(AbstractExternalServerAvailableRule.java:39)
	at org.springframework.xd.test.redis.RedisAvailableRule.apply(RedisAvailableRule.java:41)
	at org.junit.rules.RunRules.applyAll(RunRules.java:26)
	at org.junit.rules.RunRules.<init>(RunRules.java:15)
	at org.junit.runners.BlockJUnit4ClassRunner.withTestRules(BlockJUnit4ClassRunner.java:379)
(44 more lines...)
Collapse Failed GaugeHandlerTests testhandler History
Default Job 1 sec
java.lang.AssertionError: java.lang.AssertionError: REDIS IS NOT AVAILABLE
java.lang.AssertionError: REDIS IS NOT AVAILABLE
	at org.junit.Assert.fail(Assert.java:88)
	at org.springframework.xd.test.AbstractExternalServerAvailableRule.failOrSkipTests(AbstractExternalServerAvailableRule.java:39)
	at org.springframework.xd.test.redis.RedisAvailableRule.apply(RedisAvailableRule.java:41)
	at org.junit.rules.RunRules.applyAll(RunRules.java:26)
	at org.junit.rules.RunRules.<init>(RunRules.java:15)
	at org.junit.runners.BlockJUnit4ClassRunner.withTestRules(BlockJUnit4ClassRunner.java:379)
(44 more lines...)
Collapse Failed GaugeHandlerTests testConvertToDouble History
Default Job < 1 sec
java.lang.AssertionError: java.lang.AssertionError: REDIS IS NOT AVAILABLE
java.lang.AssertionError: REDIS IS NOT AVAILABLE
	at org.junit.Assert.fail(Assert.java:88)
	at org.springframework.xd.test.AbstractExternalServerAvailableRule.failOrSkipTests(AbstractExternalServerAvailableRule.java:39)
	at org.springframework.xd.test.redis.RedisAvailableRule.apply(RedisAvailableRule.java:41)
	at org.junit.rules.RunRules.applyAll(RunRules.java:26)
	at org.junit.rules.RunRules.<init>(RunRules.java:15)
	at org.junit.runners.BlockJUnit4ClassRunner.withTestRules(BlockJUnit4ClassRunner.java:379)
(44 more lines...)
Collapse Failed MessageCounterHandlerTests classMethod History
Default Job < 1 sec
java.lang.AssertionError: java.lang.AssertionError: REDIS IS NOT AVAILABLE
java.lang.AssertionError: REDIS IS NOT AVAILABLE
	at org.junit.Assert.fail(Assert.java:88)
	at org.springframework.xd.test.AbstractExternalServerAvailableRule.failOrSkipTests(AbstractExternalServerAvailableRule.java:39)
	at org.springframework.xd.test.redis.RedisAvailableRule.apply(RedisAvailableRule.java:41)
	at org.junit.rules.RunRules.applyAll(RunRules.java:26)
	at org.junit.rules.RunRules.<init>(RunRules.java:15)
	at org.junit.runners.BlockJUnit4ClassRunner.withTestRules(BlockJUnit4ClassRunner.java:379)
(35 more lines...)
Collapse Failed RichGaugeHandlerTests testParseDouble History
Default Job < 1 sec
java.lang.IllegalStateException: java.lang.IllegalStateException: Failed to load ApplicationContext
java.lang.IllegalStateException: Failed to load ApplicationContext
	at org.springframework.test.context.CacheAwareContextLoaderDelegate.loadContext(CacheAwareContextLoaderDelegate.java:99)
	at org.springframework.test.context.TestContext.getApplicationContext(TestContext.java:122)
	at org.springframework.test.context.support.DependencyInjectionTestExecutionListener.injectDependencies(DependencyInjectionTestExecutionListener.java:109)
	at org.springframework.test.context.support.DependencyInjectionTestExecutionListener.prepareTestInstance(DependencyInjectionTestExecutionListener.java:75)
	at org.springframework.test.context.TestContextManager.prepareTestInstance(TestContextManager.java:312)
	at org.springframework.test.context.junit4.SpringJUnit4ClassRunner.createTest(SpringJUnit4ClassRunner.java:211)
(122 more lines...)
Collapse Failed RichGaugeHandlerTests testhandler History
Default Job < 1 sec
java.lang.IllegalStateException: java.lang.IllegalStateException: Failed to load ApplicationContext
java.lang.IllegalStateException: Failed to load ApplicationContext
	at org.springframework.test.context.CacheAwareContextLoaderDelegate.loadContext(CacheAwareContextLoaderDelegate.java:99)
	at org.springframework.test.context.TestContext.getApplicationContext(TestContext.java:122)
	at org.springframework.test.context.support.DependencyInjectionTestExecutionListener.injectDependencies(DependencyInjectionTestExecutionListener.java:109)
	at org.springframework.test.context.support.DependencyInjectionTestExecutionListener.prepareTestInstance(DependencyInjectionTestExecutionListener.java:75)
	at org.springframework.test.context.TestContextManager.prepareTestInstance(TestContextManager.java:312)
	at org.springframework.test.context.junit4.SpringJUnit4ClassRunner.createTest(SpringJUnit4ClassRunner.java:211)
(122 more lines...)
Collapse Failed RichGaugeHandlerTests testhandlerWithExpression History
Default Job < 1 sec
java.lang.IllegalStateException: java.lang.IllegalStateException: Failed to load ApplicationContext
java.lang.IllegalStateException: Failed to load ApplicationContext
	at org.springframework.test.context.CacheAwareContextLoaderDelegate.loadContext(CacheAwareContextLoaderDelegate.java:99)
	at org.springframework.test.context.TestContext.getApplicationContext(TestContext.java:122)
	at org.springframework.test.context.support.DependencyInjectionTestExecutionListener.injectDependencies(DependencyInjectionTestExecutionListener.java:109)
	at org.springframework.test.context.support.DependencyInjectionTestExecutionListener.prepareTestInstance(DependencyInjectionTestExecutionListener.java:75)
	at org.springframework.test.context.TestContextManager.prepareTestInstance(TestContextManager.java:312)
	at org.springframework.test.context.junit4.SpringJUnit4ClassRunner.createTest(SpringJUnit4ClassRunner.java:211)
(122 more lines...)
Collapse Failed RedisAggregateCounterTests testTwoDaysDataSimulation History
Default Job < 1 sec
java.lang.AssertionError: java.lang.AssertionError: REDIS IS NOT AVAILABLE
java.lang.AssertionError: REDIS IS NOT AVAILABLE
	at org.junit.Assert.fail(Assert.java:88)
	at org.springframework.xd.test.AbstractExternalServerAvailableRule.failOrSkipTests(AbstractExternalServerAvailableRule.java:39)
	at org.springframework.xd.test.redis.RedisAvailableRule.apply(RedisAvailableRule.java:41)
	at org.junit.rules.RunRules.applyAll(RunRules.java:26)
	at org.junit.rules.RunRules.<init>(RunRules.java:15)
	at org.junit.runners.BlockJUnit4ClassRunner.withTestRules(BlockJUnit4ClassRunner.java:379)
(41 more lines...)
Collapse Failed RedisAggregateCounterTests test66MinuteCount History
Default Job < 1 sec
java.lang.AssertionError: java.lang.AssertionError: REDIS IS NOT AVAILABLE
java.lang.AssertionError: REDIS IS NOT AVAILABLE
	at org.junit.Assert.fail(Assert.java:88)
	at org.springframework.xd.test.AbstractExternalServerAvailableRule.failOrSkipTests(AbstractExternalServerAvailableRule.java:39)
	at org.springframework.xd.test.redis.RedisAvailableRule.apply(RedisAvailableRule.java:41)
	at org.junit.rules.RunRules.applyAll(RunRules.java:26)
	at org.junit.rules.RunRules.<init>(RunRules.java:15)
	at org.junit.runners.BlockJUnit4ClassRunner.withTestRules(BlockJUnit4ClassRunner.java:379)
(41 more lines...)
Collapse Failed RedisCounterRepositoryTests testDeleteNullString History
Default Job < 1 sec
java.lang.AssertionError: java.lang.AssertionError: REDIS IS NOT AVAILABLE
java.lang.AssertionError: REDIS IS NOT AVAILABLE
	at org.junit.Assert.fail(Assert.java:88)
	at org.springframework.xd.test.AbstractExternalServerAvailableRule.failOrSkipTests(AbstractExternalServerAvailableRule.java:39)
	at org.springframework.xd.test.redis.RedisAvailableRule.apply(RedisAvailableRule.java:41)
	at org.junit.rules.RunRules.applyAll(RunRules.java:26)
	at org.junit.rules.RunRules.<init>(RunRules.java:15)
	at org.junit.runners.BlockJUnit4ClassRunner.withTestRules(BlockJUnit4ClassRunner.java:379)
(41 more lines...)
Collapse Failed RedisCounterRepositoryTests testCrud History
Default Job < 1 sec
java.lang.AssertionError: java.lang.AssertionError: REDIS IS NOT AVAILABLE
java.lang.AssertionError: REDIS IS NOT AVAILABLE
	at org.junit.Assert.fail(Assert.java:88)
	at org.springframework.xd.test.AbstractExternalServerAvailableRule.failOrSkipTests(AbstractExternalServerAvailableRule.java:39)
	at org.springframework.xd.test.redis.RedisAvailableRule.apply(RedisAvailableRule.java:41)
	at org.junit.rules.RunRules.applyAll(RunRules.java:26)
	at org.junit.rules.RunRules.<init>(RunRules.java:15)
	at org.junit.runners.BlockJUnit4ClassRunner.withTestRules(BlockJUnit4ClassRunner.java:379)
(42 more lines...)
Collapse Failed RedisCounterRepositoryTests testFindOneNullCounter History
Default Job < 1 sec
java.lang.AssertionError: java.lang.AssertionError: REDIS IS NOT AVAILABLE
java.lang.AssertionError: REDIS IS NOT AVAILABLE
	at org.junit.Assert.fail(Assert.java:88)
	at org.springframework.xd.test.AbstractExternalServerAvailableRule.failOrSkipTests(AbstractExternalServerAvailableRule.java:39)
	at org.springframework.xd.test.redis.RedisAvailableRule.apply(RedisAvailableRule.java:41)
	at org.junit.rules.RunRules.applyAll(RunRules.java:26)
	at org.junit.rules.RunRules.<init>(RunRules.java:15)
	at org.junit.runners.BlockJUnit4ClassRunner.withTestRules(BlockJUnit4ClassRunner.java:379)
(41 more lines...)
Collapse Failed RedisCounterRepositoryTests findNonExistentRaisesException History
Default Job < 1 sec
java.lang.AssertionError: java.lang.AssertionError: REDIS IS NOT AVAILABLE
java.lang.AssertionError: REDIS IS NOT AVAILABLE
	at org.junit.Assert.fail(Assert.java:88)
	at org.springframework.xd.test.AbstractExternalServerAvailableRule.failOrSkipTests(AbstractExternalServerAvailableRule.java:39)
	at org.springframework.xd.test.redis.RedisAvailableRule.apply(RedisAvailableRule.java:41)
	at org.junit.rules.RunRules.applyAll(RunRules.java:26)
	at org.junit.rules.RunRules.<init>(RunRules.java:15)
	at org.junit.runners.BlockJUnit4ClassRunner.withTestRules(BlockJUnit4ClassRunner.java:379)
(41 more lines...)
Collapse Failed RedisCounterRepositoryTests testDeleteNullCounter History
Default Job < 1 sec
java.lang.AssertionError: java.lang.AssertionError: REDIS IS NOT AVAILABLE
java.lang.AssertionError: REDIS IS NOT AVAILABLE
	at org.junit.Assert.fail(Assert.java:88)
	at org.springframework.xd.test.AbstractExternalServerAvailableRule.failOrSkipTests(AbstractExternalServerAvailableRule.java:39)
	at org.springframework.xd.test.redis.RedisAvailableRule.apply(RedisAvailableRule.java:41)
	at org.junit.rules.RunRules.applyAll(RunRules.java:26)
	at org.junit.rules.RunRules.<init>(RunRules.java:15)
	at org.junit.runners.BlockJUnit4ClassRunner.withTestRules(BlockJUnit4ClassRunner.java:379)
(41 more lines...)
Collapse Failed RedisFieldValueCounterRepositoryTests testCrud History
Default Job < 1 sec
java.lang.AssertionError: java.lang.AssertionError: REDIS IS NOT AVAILABLE
java.lang.AssertionError: REDIS IS NOT AVAILABLE
	at org.junit.Assert.fail(Assert.java:88)
	at org.springframework.xd.test.AbstractExternalServerAvailableRule.failOrSkipTests(AbstractExternalServerAvailableRule.java:39)
	at org.springframework.xd.test.redis.RedisAvailableRule.apply(RedisAvailableRule.java:41)
	at org.junit.rules.RunRules.applyAll(RunRules.java:26)
	at org.junit.rules.RunRules.<init>(RunRules.java:15)
	at org.junit.runners.BlockJUnit4ClassRunner.withTestRules(BlockJUnit4ClassRunner.java:379)
(42 more lines...)
Collapse Failed RedisFieldValueCounterRepositoryTests testDeleteNullGauge History
Default Job < 1 sec
java.lang.AssertionError: java.lang.AssertionError: REDIS IS NOT AVAILABLE
java.lang.AssertionError: REDIS IS NOT AVAILABLE
	at org.junit.Assert.fail(Assert.java:88)
	at org.springframework.xd.test.AbstractExternalServerAvailableRule.failOrSkipTests(AbstractExternalServerAvailableRule.java:39)
	at org.springframework.xd.test.redis.RedisAvailableRule.apply(RedisAvailableRule.java:41)
	at org.junit.rules.RunRules.applyAll(RunRules.java:26)
	at org.junit.rules.RunRules.<init>(RunRules.java:15)
	at org.junit.runners.BlockJUnit4ClassRunner.withTestRules(BlockJUnit4ClassRunner.java:379)
(42 more lines...)
Collapse Failed RedisFieldValueCounterRepositoryTests testDeleteNullString History
Default Job < 1 sec
java.lang.AssertionError: java.lang.AssertionError: REDIS IS NOT AVAILABLE
java.lang.AssertionError: REDIS IS NOT AVAILABLE
	at org.junit.Assert.fail(Assert.java:88)
	at org.springframework.xd.test.AbstractExternalServerAvailableRule.failOrSkipTests(AbstractExternalServerAvailableRule.java:39)
	at org.springframework.xd.test.redis.RedisAvailableRule.apply(RedisAvailableRule.java:41)
	at org.junit.rules.RunRules.applyAll(RunRules.java:26)
	at org.junit.rules.RunRules.<init>(RunRules.java:15)
	at org.junit.runners.BlockJUnit4ClassRunner.withTestRules(BlockJUnit4ClassRunner.java:379)
(42 more lines...)
Collapse Failed RedisFieldValueCounterRepositoryTests testFindOneNullCounter History
Default Job < 1 sec
java.lang.AssertionError: java.lang.AssertionError: REDIS IS NOT AVAILABLE
java.lang.AssertionError: REDIS IS NOT AVAILABLE
	at org.junit.Assert.fail(Assert.java:88)
	at org.springframework.xd.test.AbstractExternalServerAvailableRule.failOrSkipTests(AbstractExternalServerAvailableRule.java:39)
	at org.springframework.xd.test.redis.RedisAvailableRule.apply(RedisAvailableRule.java:41)
	at org.junit.rules.RunRules.applyAll(RunRules.java:26)
	at org.junit.rules.RunRules.<init>(RunRules.java:15)
	at org.junit.runners.BlockJUnit4ClassRunner.withTestRules(BlockJUnit4ClassRunner.java:379)
(42 more lines...)
Collapse Failed RedisFieldValueCounterRepositoryTests testCrud2 History
Default Job < 1 sec
java.lang.AssertionError: java.lang.AssertionError: REDIS IS NOT AVAILABLE
java.lang.AssertionError: REDIS IS NOT AVAILABLE
	at org.junit.Assert.fail(Assert.java:88)
	at org.springframework.xd.test.AbstractExternalServerAvailableRule.failOrSkipTests(AbstractExternalServerAvailableRule.java:39)
	at org.springframework.xd.test.redis.RedisAvailableRule.apply(RedisAvailableRule.java:41)
	at org.junit.rules.RunRules.applyAll(RunRules.java:26)
	at org.junit.rules.RunRules.<init>(RunRules.java:15)
	at org.junit.runners.BlockJUnit4ClassRunner.withTestRules(BlockJUnit4ClassRunner.java:379)
(42 more lines...)
Collapse Failed RedisGaugeRepositoryTests testDeleteNullString History
Default Job < 1 sec
java.lang.AssertionError: java.lang.AssertionError: REDIS IS NOT AVAILABLE
java.lang.AssertionError: REDIS IS NOT AVAILABLE
	at org.junit.Assert.fail(Assert.java:88)
	at org.springframework.xd.test.AbstractExternalServerAvailableRule.failOrSkipTests(AbstractExternalServerAvailableRule.java:39)
	at org.springframework.xd.test.redis.RedisAvailableRule.apply(RedisAvailableRule.java:41)
	at org.junit.rules.RunRules.applyAll(RunRules.java:26)
	at org.junit.rules.RunRules.<init>(RunRules.java:15)
	at org.junit.runners.BlockJUnit4ClassRunner.withTestRules(BlockJUnit4ClassRunner.java:379)
(42 more lines...)
Collapse Failed RedisGaugeRepositoryTests testCrud History
Default Job < 1 sec
java.lang.AssertionError: java.lang.AssertionError: REDIS IS NOT AVAILABLE
java.lang.AssertionError: REDIS IS NOT AVAILABLE
	at org.junit.Assert.fail(Assert.java:88)
	at org.springframework.xd.test.AbstractExternalServerAvailableRule.failOrSkipTests(AbstractExternalServerAvailableRule.java:39)
	at org.springframework.xd.test.redis.RedisAvailableRule.apply(RedisAvailableRule.java:41)
	at org.junit.rules.RunRules.applyAll(RunRules.java:26)
	at org.junit.rules.RunRules.<init>(RunRules.java:15)
	at org.junit.runners.BlockJUnit4ClassRunner.withTestRules(BlockJUnit4ClassRunner.java:379)
(42 more lines...)
Collapse Failed RedisGaugeRepositoryTests testFindOneNullCounter History
Default Job < 1 sec
java.lang.AssertionError: java.lang.AssertionError: REDIS IS NOT AVAILABLE
java.lang.AssertionError: REDIS IS NOT AVAILABLE
	at org.junit.Assert.fail(Assert.java:88)
	at org.springframework.xd.test.AbstractExternalServerAvailableRule.failOrSkipTests(AbstractExternalServerAvailableRule.java:39)
	at org.springframework.xd.test.redis.RedisAvailableRule.apply(RedisAvailableRule.java:41)
	at org.junit.rules.RunRules.applyAll(RunRules.java:26)
	at org.junit.rules.RunRules.<init>(RunRules.java:15)
	at org.junit.runners.BlockJUnit4ClassRunner.withTestRules(BlockJUnit4ClassRunner.java:379)
(42 more lines...)
Collapse Failed RedisGaugeRepositoryTests testDeleteNullGauge History
Default Job < 1 sec
java.lang.AssertionError: java.lang.AssertionError: REDIS IS NOT AVAILABLE
java.lang.AssertionError: REDIS IS NOT AVAILABLE
	at org.junit.Assert.fail(Assert.java:88)
	at org.springframework.xd.test.AbstractExternalServerAvailableRule.failOrSkipTests(AbstractExternalServerAvailableRule.java:39)
	at org.springframework.xd.test.redis.RedisAvailableRule.apply(RedisAvailableRule.java:41)
	at org.junit.rules.RunRules.applyAll(RunRules.java:26)
	at org.junit.rules.RunRules.<init>(RunRules.java:15)
	at org.junit.runners.BlockJUnit4ClassRunner.withTestRules(BlockJUnit4ClassRunner.java:379)
(42 more lines...)
Collapse Failed RedisRichGaugeRepositoryTests getOrCreateReturnsCorrectInstance History
Default Job < 1 sec
java.lang.AssertionError: java.lang.AssertionError: REDIS IS NOT AVAILABLE
java.lang.AssertionError: REDIS IS NOT AVAILABLE
	at org.junit.Assert.fail(Assert.java:88)
	at org.springframework.xd.test.AbstractExternalServerAvailableRule.failOrSkipTests(AbstractExternalServerAvailableRule.java:39)
	at org.springframework.xd.test.redis.RedisAvailableRule.apply(RedisAvailableRule.java:41)
	at org.junit.rules.RunRules.applyAll(RunRules.java:26)
	at org.junit.rules.RunRules.<init>(RunRules.java:15)
	at org.junit.runners.BlockJUnit4ClassRunner.withTestRules(BlockJUnit4ClassRunner.java:379)
(44 more lines...)
Collapse Failed RedisRichGaugeRepositoryTests testExponentialMovingAverage History
Default Job < 1 sec
java.lang.AssertionError: java.lang.AssertionError: REDIS IS NOT AVAILABLE
java.lang.AssertionError: REDIS IS NOT AVAILABLE
	at org.junit.Assert.fail(Assert.java:88)
	at org.springframework.xd.test.AbstractExternalServerAvailableRule.failOrSkipTests(AbstractExternalServerAvailableRule.java:39)
	at org.springframework.xd.test.redis.RedisAvailableRule.apply(RedisAvailableRule.java:41)
	at org.junit.rules.RunRules.applyAll(RunRules.java:26)
	at org.junit.rules.RunRules.<init>(RunRules.java:15)
	at org.junit.runners.BlockJUnit4ClassRunner.withTestRules(BlockJUnit4ClassRunner.java:379)
(44 more lines...)
Collapse Failed RedisRichGaugeRepositoryTests resetExistingGaugeCausesReset History
Default Job < 1 sec
java.lang.AssertionError: java.lang.AssertionError: REDIS IS NOT AVAILABLE
java.lang.AssertionError: REDIS IS NOT AVAILABLE
	at org.junit.Assert.fail(Assert.java:88)
	at org.springframework.xd.test.AbstractExternalServerAvailableRule.failOrSkipTests(AbstractExternalServerAvailableRule.java:39)
	at org.springframework.xd.test.redis.RedisAvailableRule.apply(RedisAvailableRule.java:41)
	at org.junit.rules.RunRules.applyAll(RunRules.java:26)
	at org.junit.rules.RunRules.<init>(RunRules.java:15)
	at org.junit.runners.BlockJUnit4ClassRunner.withTestRules(BlockJUnit4ClassRunner.java:379)
(44 more lines...)
Collapse Failed AbstractRedisRepositoryTests classMethod History
Default Job < 1 sec
java.lang.AssertionError: java.lang.AssertionError: REDIS IS NOT AVAILABLE
java.lang.AssertionError: REDIS IS NOT AVAILABLE
	at org.junit.Assert.fail(Assert.java:88)
	at org.springframework.xd.test.AbstractExternalServerAvailableRule.failOrSkipTests(AbstractExternalServerAvailableRule.java:39)
	at org.springframework.xd.test.redis.RedisAvailableRule.apply(RedisAvailableRule.java:41)
	at org.junit.rules.RunRules.applyAll(RunRules.java:26)
	at org.junit.rules.RunRules.<init>(RunRules.java:15)
	at org.junit.runners.BlockJUnit4ClassRunner.withTestRules(BlockJUnit4ClassRunner.java:379)
(37 more lines...)