https://github.com/SpringSource/spring-xd

Build: #1714 failed

Job: Default Job failed

Stages & jobs

  1. Default Stage

Job result summary

Completed
Duration
17 minutes
Revision
82f6fdd43dadde43ecb5b4e1b09fbd3b460f5f95 82f6fdd43dadde43ecb5b4e1b09fbd3b460f5f95
Total tests
922
Fixed in
#1717 (Manual run by Mark Pollack)

Tests

  • 922 tests in total
  • 1 test failed
  • 1 failure is new
  • 11 minutes taken in total.
New test failures 1
Status Test Duration
Collapse Failed SecurityConfigurationTests testFormAuthentication History
< 1 sec
java.lang.AssertionError: java.lang.AssertionError: Range for response status value 401 expected:<REDIRECTION> but was:<CLIENT_ERROR>
java.lang.AssertionError: Range for response status value 401 expected:<REDIRECTION> but was:<CLIENT_ERROR>
	at org.springframework.test.util.AssertionErrors.fail(AssertionErrors.java:60)
	at org.springframework.test.util.AssertionErrors.assertEquals(AssertionErrors.java:89)
	at org.springframework.test.web.servlet.result.StatusResultMatchers$5.match(StatusResultMatchers.java:101)
	at org.springframework.test.web.servlet.MockMvc$1.andExpect(MockMvc.java:149)
	at org.springframework.xd.dirt.web.SecurityConfigurationTests.testFormAuthentication(SecurityConfigurationTests.java:103)
	at sun.reflect.NativeMethodAccessorImpl.invoke0(Native Method)
(49 more lines...)