https://github.com/SpringSource/spring-xd

Build: #1760 failed

Job: Default Job failed

Stages & jobs

  1. Default Stage

Job result summary

Completed
Duration
12 minutes
Revision
8ae0433777d637e016fd150df92f462788927ee3 8ae0433777d637e016fd150df92f462788927ee3
Total tests
663
Fixed in
#1761 (Manual run by Ilayaperumal Gopinathan)

Tests

  • 663 tests in total
  • 3 tests failed
  • 3 failures are new
  • 7 minutes taken in total.
New test failures 3
Status Test Duration
Collapse Failed ShellCommandProcessorTests echoTest History
< 1 sec
java.lang.RuntimeException: java.lang.RuntimeException: Stream closed between payloads
java.lang.RuntimeException: Stream closed between payloads
	at org.springframework.xd.extension.process.ShellCommandProcessor.receive(ShellCommandProcessor.java:137)
	at org.springframework.xd.extension.process.ShellCommandProcessor.sendAndReceive(ShellCommandProcessor.java:164)
	at org.springframework.xd.extension.process.ShellCommandProcessorTests.doEchoTest(ShellCommandProcessorTests.java:102)
	at org.springframework.xd.extension.process.ShellCommandProcessorTests.echoTest(ShellCommandProcessorTests.java:55)
	at sun.reflect.NativeMethodAccessorImpl.invoke0(Native Method)
	at sun.reflect.NativeMethodAccessorImpl.invoke(NativeMethodAccessorImpl.java:57)
(49 more lines...)
Collapse Failed ShellCommandProcessorTests echoTestWithLFEncoder History
< 1 sec
java.lang.RuntimeException: java.lang.RuntimeException: Stream closed between payloads
java.lang.RuntimeException: Stream closed between payloads
	at org.springframework.xd.extension.process.ShellCommandProcessor.receive(ShellCommandProcessor.java:137)
	at org.springframework.xd.extension.process.ShellCommandProcessor.sendAndReceive(ShellCommandProcessor.java:164)
	at org.springframework.xd.extension.process.ShellCommandProcessorTests.doEchoTest(ShellCommandProcessorTests.java:102)
	at org.springframework.xd.extension.process.ShellCommandProcessorTests.echoTestWithLFEncoder(ShellCommandProcessorTests.java:64)
	at sun.reflect.NativeMethodAccessorImpl.invoke0(Native Method)
	at sun.reflect.NativeMethodAccessorImpl.invoke(NativeMethodAccessorImpl.java:57)
(48 more lines...)
Collapse Failed ShellCommandProcessorTests testUTF8 History
< 1 sec
java.lang.RuntimeException: java.lang.RuntimeException: Stream closed between payloads
java.lang.RuntimeException: Stream closed between payloads
	at org.springframework.xd.extension.process.ShellCommandProcessor.receive(ShellCommandProcessor.java:137)
	at org.springframework.xd.extension.process.ShellCommandProcessor.sendAndReceive(ShellCommandProcessor.java:164)
	at org.springframework.xd.extension.process.ShellCommandProcessorTests.testUTF8(ShellCommandProcessorTests.java:114)
	at sun.reflect.NativeMethodAccessorImpl.invoke0(Native Method)
	at sun.reflect.NativeMethodAccessorImpl.invoke(NativeMethodAccessorImpl.java:57)
	at sun.reflect.DelegatingMethodAccessorImpl.invoke(DelegatingMethodAccessorImpl.java:43)
(48 more lines...)