https://github.com/SpringSource/spring-xd

Build: #2029 failed

Job: Default Job failed

Stages & jobs

  1. Default Stage

Job result summary

Completed
Duration
25 minutes
Revision
0838465b174dc53d6697d79f35422c1f7f6f5af1 0838465b174dc53d6697d79f35422c1f7f6f5af1
Total tests
708
Failing since
#2020 (Code changes detected – )
Fixed in
#2034 (Manual run by mbg_at_pivotal)

Tests

  • 708 tests in total
  • 1 test failed
  • 1 test was fixed
  • 1 test was quarantined / skipped
  • 12 minutes taken in total.
Existing test failures 1
Status Test Failing since Duration
java.lang.IllegalArgumentException: java.lang.IllegalArgumentException: Must provide at least one partition
java.lang.IllegalArgumentException: Must provide at least one partition
	at org.springframework.util.Assert.isTrue(Assert.java:65)
	at org.springframework.integration.kafka.core.DefaultConnection.fetchInitialOffset(DefaultConnection.java:177)
	at org.springframework.xd.dirt.stream.KafkaSingleNodeStreamDeploymentIntegrationTests.getInitialOffset(KafkaSingleNodeStreamDeploymentIntegrationTests.java:145)
	at org.springframework.xd.dirt.stream.KafkaSingleNodeStreamDeploymentIntegrationTests.readInitialQueueState(KafkaSingleNodeStreamDeploymentIntegrationTests.java:121)
	at org.springframework.xd.dirt.stream.AbstractSingleNodeStreamDeploymentIntegrationTests.verifyQueueChannelsRegisteredOnDemand(AbstractSingleNodeStreamDeploymentIntegrationTests.java:416)
	at sun.reflect.NativeMethodAccessorImpl.invoke0(Native Method)
(46 more lines...)
Fixed tests 1
Status Test Failing since Duration
Successful FileSourceModuleTests testFileReference History
Failing since build #2027 (Code changes detected) 1 sec