https://github.com/SpringSource/spring-xd

Build: #2201 failed

Job: Default Job failed

Stages & jobs

  1. Default Stage

Job result summary

Completed
Duration
52 minutes
Revision
27ace30c0fc6052cd8980380e28967dd98c5ce85 27ace30c0fc6052cd8980380e28967dd98c5ce85
Total tests
1112
Fixed in
#2204 (Manual run by Ilayaperumal Gopinathan)

Tests

  • 1,112 tests in total
  • 2 tests failed
  • 2 failures are new
  • 6 tests were quarantined / skipped
  • 22 minutes taken in total.
New test failures 2
Status Test Duration
Collapse Failed KafkaSourceSinkTests testKafkaSourceAndSink History
40 secs
java.lang.AssertionError: java.lang.AssertionError
java.lang.AssertionError
	at org.junit.Assert.fail(Assert.java:86)
	at org.junit.Assert.assertTrue(Assert.java:41)
	at org.junit.Assert.assertTrue(Assert.java:52)
	at org.springframework.xd.shell.command.StreamCommandTemplate.verifyExists(StreamCommandTemplate.java:162)
	at org.springframework.xd.shell.command.StreamCommandTemplate.doCreate(StreamCommandTemplate.java:99)
	at org.springframework.xd.shell.command.StreamCommandTemplate.create(StreamCommandTemplate.java:65)
(64 more lines...)
Collapse Failed KafkaSourceSinkTests testKafkaSourceAndSinkWithMultiTopics History
43 secs
java.lang.AssertionError: java.lang.AssertionError
java.lang.AssertionError
	at org.junit.Assert.fail(Assert.java:86)
	at org.junit.Assert.assertTrue(Assert.java:41)
	at org.junit.Assert.assertTrue(Assert.java:52)
	at org.springframework.xd.shell.command.StreamCommandTemplate.verifyExists(StreamCommandTemplate.java:162)
	at org.springframework.xd.shell.command.StreamCommandTemplate.doCreate(StreamCommandTemplate.java:99)
	at org.springframework.xd.shell.command.StreamCommandTemplate.create(StreamCommandTemplate.java:65)
(64 more lines...)