https://github.com/SpringSource/spring-xd

Build: #2205 failed

Job: Default Job failed

Stages & jobs

  1. Default Stage

Job result summary

Completed
Duration
27 minutes
Revision
936c22938d8b4914b5f2ea0ad719d274558d70f1 936c22938d8b4914b5f2ea0ad719d274558d70f1
Total tests
717
Fixed in
#2208 (Code changes detected)

Tests

  • 717 tests in total
  • 1 test failed
  • 1 failure is new
  • 5 tests were quarantined / skipped
  • 13 minutes taken in total.
New test failures 1
Status Test Duration
Collapse Failed RabbitSingleNodeStreamDeploymentIntegrationTests testRoutingWithGroovy History
< 1 sec
org.springframework.xd.dirt.server.admin.deployment.DeploymentException: org.springframework.xd.dirt.server.admin.deployment.DeploymentException: routerDefinition
org.springframework.xd.dirt.server.admin.deployment.DeploymentException: routerDefinition
	at org.springframework.xd.dirt.stream.AbstractInstancePersistingDeployer.deployResource(AbstractInstancePersistingDeployer.java:134)
	at org.springframework.xd.dirt.stream.AbstractInstancePersistingDeployer.deploy(AbstractInstancePersistingDeployer.java:84)
	at org.springframework.xd.dirt.test.SingleNodeIntegrationTestSupport.waitForDeploy(SingleNodeIntegrationTestSupport.java:296)
	at org.springframework.xd.dirt.test.SingleNodeIntegrationTestSupport.waitForDeploy(SingleNodeIntegrationTestSupport.java:292)
	at org.springframework.xd.dirt.test.SingleNodeIntegrationTestSupport.deployStream(SingleNodeIntegrationTestSupport.java:157)
	at org.springframework.xd.dirt.stream.AbstractSingleNodeStreamDeploymentIntegrationTests.doTest(AbstractSingleNodeStreamDeploymentIntegrationTests.java:625)
(59 more lines...)