https://github.com/SpringSource/spring-xd

Build: #2206 failed

Job: Default Job failed

Stages & jobs

  1. Default Stage

Job result summary

Completed
Duration
39 minutes
Revision
d992a84c9372e3c31b4d83d262e9ee22f885db57 d992a84c9372e3c31b4d83d262e9ee22f885db57
Total tests
1113
Failing since
#2205 (Code changes detected – )
Fixed in
#2208 (Code changes detected)

Tests

  • 1,113 tests in total
  • 1 test failed
  • 1 failure is new
  • 1 test was fixed
  • 6 tests were quarantined / skipped
  • 21 minutes taken in total.
New test failures 1
Status Test Duration
Collapse Failed FileSourceAndFileSinkTests testNameAndDirExpression History
2 secs
java.lang.AssertionError: java.lang.AssertionError: expected:<true> but was:<is <true>>
java.lang.AssertionError: expected:<true> but was:<is <true>>
	at org.junit.Assert.fail(Assert.java:88)
	at org.junit.Assert.failNotEquals(Assert.java:834)
	at org.junit.Assert.assertEquals(Assert.java:118)
	at org.junit.Assert.assertEquals(Assert.java:144)
	at org.springframework.xd.shell.command.FileSourceAndFileSinkTests.testFileSinkSource(FileSourceAndFileSinkTests.java:148)
	at org.springframework.xd.shell.command.FileSourceAndFileSinkTests.testNameAndDirExpression(FileSourceAndFileSinkTests.java:76)
(62 more lines...)
Fixed tests 1
Status Test Failing since Duration
Successful RabbitSingleNodeStreamDeploymentIntegrationTests testRoutingWithGroovy History
Failing since build #2205 (Code changes detected) 2 secs