https://github.com/SpringSource/spring-xd

Build: #2207 failed

Job: Default Job failed

Stages & jobs

  1. Default Stage

Job result summary

Completed
Duration
39 minutes
Revision
c9b626a2e084f45076df8094dfa95782c3758212 c9b626a2e084f45076df8094dfa95782c3758212
Total tests
1113
Failing since
#2205 (Code changes detected – )
Fixed in
#2208 (Code changes detected)

Tests

  • 1,113 tests in total
  • 1 test failed
  • 6 tests were quarantined / skipped
  • 21 minutes taken in total.
Existing test failures 1
Status Test Failing since Duration
java.lang.AssertionError: java.lang.AssertionError: expected:<true> but was:<is <true>>
java.lang.AssertionError: expected:<true> but was:<is <true>>
	at org.junit.Assert.fail(Assert.java:88)
	at org.junit.Assert.failNotEquals(Assert.java:834)
	at org.junit.Assert.assertEquals(Assert.java:118)
	at org.junit.Assert.assertEquals(Assert.java:144)
	at org.springframework.xd.shell.command.FileSourceAndFileSinkTests.testFileSinkSource(FileSourceAndFileSinkTests.java:148)
	at org.springframework.xd.shell.command.FileSourceAndFileSinkTests.testNameAndDirExpression(FileSourceAndFileSinkTests.java:76)
(62 more lines...)