https://github.com/SpringSource/spring-xd

Build: #2212 failed

Job: Default Job failed

Stages & jobs

  1. Default Stage

Job result summary

Completed
Duration
26 minutes
Revision
9a128ff7e6cf02f5b658b185cc126f70bf60124f 9a128ff7e6cf02f5b658b185cc126f70bf60124f
Total tests
717
Fixed in
#2213 (Manual run by Mark Pollack)

Tests

  • 717 tests in total
  • 2 tests failed
  • 2 failures are new
  • 5 tests were quarantined / skipped
  • 13 minutes taken in total.
New test failures 2
Status Test Duration
Collapse Failed KafkaSingleNodeStreamDeploymentIntegrationTests testBasicTap History
4 secs
java.lang.AssertionError: java.lang.AssertionError: expected:<DRACARYS!> but was:<null>
java.lang.AssertionError: expected:<DRACARYS!> but was:<null>
	at org.junit.Assert.fail(Assert.java:88)
	at org.junit.Assert.failNotEquals(Assert.java:834)
	at org.junit.Assert.assertEquals(Assert.java:118)
	at org.junit.Assert.assertEquals(Assert.java:144)
	at org.springframework.xd.dirt.stream.AbstractSingleNodeStreamDeploymentIntegrationTests.tapTest(AbstractSingleNodeStreamDeploymentIntegrationTests.java:609)
	at org.springframework.xd.dirt.stream.AbstractSingleNodeStreamDeploymentIntegrationTests.testBasicTap(AbstractSingleNodeStreamDeploymentIntegrationTests.java:273)
(47 more lines...)
Collapse Failed RabbitSingleNodeStreamDeploymentIntegrationTests directBindingEnabledForPartOfStream History
< 1 sec
org.springframework.xd.dirt.server.admin.deployment.DeploymentException: org.springframework.xd.dirt.server.admin.deployment.DeploymentException: directBindingEnabledForPartOfStream
org.springframework.xd.dirt.server.admin.deployment.DeploymentException: directBindingEnabledForPartOfStream
	at org.springframework.xd.dirt.stream.AbstractInstancePersistingDeployer.deployResource(AbstractInstancePersistingDeployer.java:134)
	at org.springframework.xd.dirt.stream.AbstractInstancePersistingDeployer.deploy(AbstractInstancePersistingDeployer.java:84)
	at org.springframework.xd.dirt.test.SingleNodeIntegrationTestSupport.waitForDeploy(SingleNodeIntegrationTestSupport.java:296)
	at org.springframework.xd.dirt.test.SingleNodeIntegrationTestSupport.deployStream(SingleNodeIntegrationTestSupport.java:167)
	at org.springframework.xd.dirt.stream.AbstractDistributedTransportSingleNodeStreamDeploymentIntegrationTests.directBindingEnabledForPartOfStream(AbstractDistributedTransportSingleNodeStreamDeploymentIntegrationTests.java:153)
	at sun.reflect.NativeMethodAccessorImpl.invoke0(Native Method)
(56 more lines...)