https://github.com/SpringSource/spring-xd

Build: #2217 failed

Job: Default Job failed

Stages & jobs

  1. Default Stage

Job result summary

Completed
Duration
27 minutes
Revision
50e0f8298b3c6808316ead0a082eb34804ceb857 50e0f8298b3c6808316ead0a082eb34804ceb857
Total tests
717
Fixed in
#2219 (Manual run by Mark Pollack)

Tests

  • 717 tests in total
  • 1 test failed
  • 1 failure is new
  • 5 tests were quarantined / skipped
  • 13 minutes taken in total.
New test failures 1
Status Test Duration
Collapse Failed RabbitSingleNodeStreamDeploymentIntegrationTests directBindingNotEnabledWithOverriddenCount History
< 1 sec
org.springframework.xd.dirt.server.admin.deployment.DeploymentException: org.springframework.xd.dirt.server.admin.deployment.DeploymentException: directBindingNotEnabledWithOverriddenCount
org.springframework.xd.dirt.server.admin.deployment.DeploymentException: directBindingNotEnabledWithOverriddenCount
	at org.springframework.xd.dirt.stream.AbstractInstancePersistingDeployer.deployResource(AbstractInstancePersistingDeployer.java:134)
	at org.springframework.xd.dirt.stream.AbstractInstancePersistingDeployer.deploy(AbstractInstancePersistingDeployer.java:84)
	at org.springframework.xd.dirt.test.SingleNodeIntegrationTestSupport.waitForDeploy(SingleNodeIntegrationTestSupport.java:306)
	at org.springframework.xd.dirt.test.SingleNodeIntegrationTestSupport.deployStream(SingleNodeIntegrationTestSupport.java:179)
	at org.springframework.xd.dirt.stream.AbstractDistributedTransportSingleNodeStreamDeploymentIntegrationTests.directBindingNotEnabledWithOverriddenCount(AbstractDistributedTransportSingleNodeStreamDeploymentIntegrationTests.java:115)
	at sun.reflect.NativeMethodAccessorImpl.invoke0(Native Method)
(56 more lines...)