https://github.com/SpringSource/spring-xd

Build: #2224 failed

Job: Default Job failed

Stages & jobs

  1. Default Stage

Job result summary

Completed
Duration
40 minutes
Revision
6d265974267ff047aa125953039648bcb6ed9c80 6d265974267ff047aa125953039648bcb6ed9c80
Total tests
1113
Fixed in
#2227 (Code changes detected)

Tests

  • 1,113 tests in total
  • 1 test failed
  • 1 failure is new
  • 6 tests were quarantined / skipped
  • 21 minutes taken in total.
New test failures 1
Status Test Duration
Collapse Failed FtpModulesTests testBasicSinkModuleBehavior History
1 sec
java.lang.AssertionError: java.lang.AssertionError: only one file should have been created !
Expected: is <1>
     but: was <0>
java.lang.AssertionError: only one file should have been created !
Expected: is <1>
     but: was <0>
	at org.hamcrest.MatcherAssert.assertThat(MatcherAssert.java:20)
	at org.junit.Assert.assertThat(Assert.java:956)
(62 more lines...)