https://github.com/SpringSource/spring-xd

Build: #2232 failed

Job: Default Job failed

Stages & jobs

  1. Default Stage

Test results

  • 717 tests in total
  • 1 test failed
  • 1 failure is new
  • 5 tests were quarantined / skipped
  • 13 minutes taken in total.

Build 2,232 has the following 1 errors: 1 new failure(s) occurred since the previous build.

New test failures 1
Status Test Duration
Collapse Failed RabbitSingleNodeStreamDeploymentIntegrationTests directBindingNotEnabledWithMismatchedCounts History
< 1 sec
org.springframework.xd.dirt.server.admin.deployment.DeploymentException: org.springframework.xd.dirt.server.admin.deployment.DeploymentException: directBindingNotEnabledWithMismatchedCounts
org.springframework.xd.dirt.server.admin.deployment.DeploymentException: directBindingNotEnabledWithMismatchedCounts
	at org.springframework.xd.dirt.stream.AbstractInstancePersistingDeployer.deployResource(AbstractInstancePersistingDeployer.java:134)
	at org.springframework.xd.dirt.stream.AbstractInstancePersistingDeployer.deploy(AbstractInstancePersistingDeployer.java:84)
	at org.springframework.xd.dirt.test.SingleNodeIntegrationTestSupport.waitForDeploy(SingleNodeIntegrationTestSupport.java:306)
	at org.springframework.xd.dirt.test.SingleNodeIntegrationTestSupport.deployStream(SingleNodeIntegrationTestSupport.java:179)
	at org.springframework.xd.dirt.stream.AbstractDistributedTransportSingleNodeStreamDeploymentIntegrationTests.directBindingNotEnabledWithMismatchedCounts(AbstractDistributedTransportSingleNodeStreamDeploymentIntegrationTests.java:98)
	at sun.reflect.NativeMethodAccessorImpl.invoke0(Native Method)
(56 more lines...)