https://github.com/SpringSource/spring-xd

Build: #2233 failed

Job: Default Job failed

Stages & jobs

  1. Default Stage

Job result summary

Completed
Duration
27 minutes
Revision
de27c762de88a648f64c67fd08ab52ce63ac00bc de27c762de88a648f64c67fd08ab52ce63ac00bc
Total tests
717
Failing since
#2232 (Code changes detected – )
Fixed in
#2234 (Code changes detected)

Tests

  • 717 tests in total
  • 1 test failed
  • 1 failure is new
  • 1 test was fixed
  • 5 tests were quarantined / skipped
  • 13 minutes taken in total.
New test failures 1
Status Test Duration
Collapse Failed KafkaMessageBusTests testPartitionedModuleJava History
1 sec
java.lang.AssertionError: java.lang.AssertionError
java.lang.AssertionError
	at org.junit.Assert.fail(Assert.java:86)
	at org.junit.Assert.assertTrue(Assert.java:41)
	at org.junit.Assert.assertNotNull(Assert.java:712)
	at org.junit.Assert.assertNotNull(Assert.java:722)
	at org.springframework.xd.dirt.integration.bus.PartitionCapableBusTests.testPartitionedModuleJava(PartitionCapableBusTests.java:225)
	at sun.reflect.NativeMethodAccessorImpl.invoke0(Native Method)
(42 more lines...)
Fixed tests 1
Status Test Failing since Duration
Successful RabbitSingleNodeStreamDeploymentIntegrationTests directBindingNotEnabledWithMismatchedCounts History
Failing since build #2232 (Code changes detected) 1 sec