https://github.com/SpringSource/spring-xd

Build: #2236 failed

Job: Default Job failed

Stages & jobs

  1. Default Stage

Job result summary

Completed
Duration
29 minutes
Revision
2180cdcf5537ba8cc763f71ab8245ef6be7fbe22 2180cdcf5537ba8cc763f71ab8245ef6be7fbe22
Total tests
725
Fixed in
#2237 (Code changes detected)

Tests

  • 725 tests in total
  • 1 test failed
  • 1 failure is new
  • 5 tests were quarantined / skipped
  • 14 minutes taken in total.
New test failures 1
Status Test Duration
Collapse Failed KafkaSingleNodeStreamDeploymentIntegrationTests deployAndUndeploy History
1 min
java.lang.AssertionError: java.lang.AssertionError: stream test4 (BaseDefinition [definition=http --port=49708| transform --expression=payload | filter --expression=true | log, name=test4]) not deployed
java.lang.AssertionError: stream test4 (BaseDefinition [definition=http --port=49708| transform --expression=payload | filter --expression=true | log, name=test4]) not deployed
	at org.junit.Assert.fail(Assert.java:88)
	at org.junit.Assert.assertTrue(Assert.java:41)
	at org.springframework.xd.dirt.stream.AbstractSingleNodeStreamDeploymentIntegrationTests.deployAndUndeploy(AbstractSingleNodeStreamDeploymentIntegrationTests.java:360)
	at sun.reflect.NativeMethodAccessorImpl.invoke0(Native Method)
	at sun.reflect.NativeMethodAccessorImpl.invoke(NativeMethodAccessorImpl.java:57)
	at sun.reflect.DelegatingMethodAccessorImpl.invoke(DelegatingMethodAccessorImpl.java:43)
(44 more lines...)