https://github.com/SpringSource/spring-xd

Build: #2236 failed

Job: Default Job failed

Stages & jobs

  1. Default Stage

Test results

  • 725 tests in total
  • 1 test failed
  • 1 failure is new
  • 5 tests were quarantined / skipped
  • 14 minutes taken in total.

Build 2,236 has the following 1 errors: 1 new failure(s) occurred since the previous build.

New test failures 1
Status Test Duration
Collapse Failed KafkaSingleNodeStreamDeploymentIntegrationTests deployAndUndeploy History
1 min
java.lang.AssertionError: java.lang.AssertionError: stream test4 (BaseDefinition [definition=http --port=49708| transform --expression=payload | filter --expression=true | log, name=test4]) not deployed
java.lang.AssertionError: stream test4 (BaseDefinition [definition=http --port=49708| transform --expression=payload | filter --expression=true | log, name=test4]) not deployed
	at org.junit.Assert.fail(Assert.java:88)
	at org.junit.Assert.assertTrue(Assert.java:41)
	at org.springframework.xd.dirt.stream.AbstractSingleNodeStreamDeploymentIntegrationTests.deployAndUndeploy(AbstractSingleNodeStreamDeploymentIntegrationTests.java:360)
	at sun.reflect.NativeMethodAccessorImpl.invoke0(Native Method)
	at sun.reflect.NativeMethodAccessorImpl.invoke(NativeMethodAccessorImpl.java:57)
	at sun.reflect.DelegatingMethodAccessorImpl.invoke(DelegatingMethodAccessorImpl.java:43)
(44 more lines...)