https://github.com/SpringSource/spring-xd

Build: #2243 failed

Job: Default Job failed

Stages & jobs

  1. Default Stage

Job result summary

Completed
Duration
44 minutes
Revision
dec08262dfe945ada0b6ebb0cd5da9c91484e67b dec08262dfe945ada0b6ebb0cd5da9c91484e67b
Total tests
725
Fixed in
#2246 (Code changes detected)

Tests

  • 725 tests in total
  • 1 test failed
  • 1 failure is new
  • 5 tests were quarantined / skipped
  • 13 minutes taken in total.
New test failures 1
Status Test Duration
Collapse Failed KafkaMessageBusTests testPartitionedModuleSpEL History
2 secs
java.lang.AssertionError: java.lang.AssertionError
java.lang.AssertionError
	at org.junit.Assert.fail(Assert.java:86)
	at org.junit.Assert.assertTrue(Assert.java:41)
	at org.junit.Assert.assertNotNull(Assert.java:712)
	at org.junit.Assert.assertNotNull(Assert.java:722)
	at org.springframework.xd.dirt.integration.bus.PartitionCapableBusTests.testPartitionedModuleSpEL(PartitionCapableBusTests.java:137)
	at sun.reflect.NativeMethodAccessorImpl.invoke0(Native Method)
(42 more lines...)